{"text_format":"1","workbook":"xlsx","n_sheets":11,"sheets":["Home","Student Profile","UT1","UT 2","UT 3 ","TT 1","UT 4","UT 5PB1","PREANNU PB2 ","ANNUAL","CONSOL."],"not_rendered":{"charts":0,"images":3,"macros":0,"external_links":0,"defined_names":2,"comments":10,"pivot_tables":0},"unopened":[],"bounds":{"document_bytes":16777216,"sheet_cells":100000,"rows_first":2000,"rows_last":500,"rows_between":2000,"halvings":0,"cell_chars":16384,"cell_head_chars":4096},"cells_cut":0,"cells_raw":0,"read":"whole","date_system":"1900"}

{"sheet":"Home","index":0,"n_rows":42,"n_cols":14,"rows_kept":42,"cut":false,"hidden":false,"merged":[[10,2,10,10],[11,1,11,10],[14,3,20,3],[14,6,20,6],[14,7,20,7],[14,8,20,8],[13,1,13,9],[14,9,20,9],[14,4,20,4],[14,2,16,2],[17,2,20,2],[14,5,16,5],[17,5,20,5],[26,0,26,1],[12,1,12,10],[4,1,4,10],[0,1,0,10],[1,1,1,10],[2,2,2,7],[2,8,2,10],[3,1,3,10],[5,1,5,10],[6,2,6,7],[6,8,6,10],[7,2,7,10],[8,2,8,10],[9,2,9,10],[22,1,22,10],[21,1,21,10],[8,13,8,21],[0,12,0,21],[3,13,3,21],[4,13,4,21],[5,13,5,21],[6,13,6,21],[7,13,7,21]]}
[null,"PLEASE DON’T CRACK THE SOFTWARE",null,null,null,null,null,null,null,null,null,null,"Before the use of this particular format, please read the instruction Carefully. This is just the effort to minimize the work. The Designer are not responsible for any kind of error. Please check at your level to find the accuracy of the format."]
[null,"Result Compilation Software for Class XI & XII"]
[]
[null,"Designed By:-Dr.Sunil Kumar Vats, PGT  Computer Science, JNV Mohindergarh",null,null,null,null,null,null,null,null,null,null,null,"Formula adopted to Calculate the Final Result:"]
[null,"E-Mail:- sunilvats1981@gmail.com,sunilvats27@yahoo.com",null,null,null,null,null,null,null,null,null,null,null,"Two Best from UT1, UT2 and UT3 with 20% weightage  (10% for each Unit Test)"]
[null,"PLEASE DON’T CRACK THE SOFTWARE",null,null,null,null,null,null,null,null,null,null,null,"Two Best from UT4, UT5 and UT6/Pre Annual with 20% weightage (10% for each Unit Test)"]
[null,"NAME OF JNV","JAWAHAR NAVODAYA VIDYALAYA, ",null,null,null,null,null,"MOHINDERGARH",null,null,null,null,"Term Test 1 30% weightage"]
[null,"SESSION","2019-20",null,null,null,null,null,null,null,null,null,null,"Term Test 2 30% weightage"]
[null,"CLASS & SEC","XII A",null,null,null,null,null,null,null,null,null,null,"Total= 20+20+30+30"]
[null,"REGION","JAIPUR"]
[null,"CLASS TEACHER","DR. SUNIL VATS"]
[null,"NOTE : Click on the underlined text for going to the particular sheet"]
[null,"STUDENTS PROFILE "]
[null,"MARK LIST",null,null,null,null,null,null,null,null,"HOUSE"]
[null,"ENGLISH","UT 1","UT 3","TERM TEST 1","UT 4","UT 6/ PRE ANNUAL","TERM TEST 2","COSOLIDATE\n (SUBJECT WISE","STUDENT PROFILE","ARAWALI"]
[null,"HINDI",null,null,null,null,null,null,null,null,"NILGIRI"]
[null,"INFO PRACT",null,null,null,null,null,null,null,null,"SHIVALIK"]
[null,"MATH","UT 2",null,null,"UT 5",null,null,null,null,"UDAIGIRI"]
[null,"CHEM"]
[null,"PHYSICS"]
[null,"BIO"]
[null,"For Any Help:- 9067892000, E-mail : sunilvats1981@gmail.com"]
[null,"NOTE:- CLICK ON REQUIRED FIELD TO MOVE ON"]
[]
[]
[]
["Note:-"]
[null,"1. Enter your School Name, Session, Class,Region and Class Teacher Name"]
[null,"2. CHOOSE SUBJECTS OF STUDENTS FROM \"STUDENT PROFILE\" SHEET"]
[null,"3. TO ENTER THE PROFILE OF THE STUDENT CLICK ON STUDENT PROFILE AND FILL THE REQUIRED FILED."]
[null,"4. IN STUDENT PROFILE ENTER THE SUBJECT OPTED BY THE STUDENT."]
[null,"5. PERCENTAGE OF THE MARKS ARE BASED ON THE NUMBER OF SUBJECT ENTERED BY YOU. SO FOR BETTER RESULT, ENTER THE PROPER DETAIL OF THE SUBJECTS."]
[null,"6. BEFORE ENTERING THE MARKS (UT 1,UT 2, TT 1,UT 3, UT 4, UT 4, UT5, PB1 ETC. SET THE M.M. (MAXIMUM MARKS)"]
[null,"7. FOR THE UPDATED VERSION OF ANY SOFTWARE DESIGNED BY ME, YOU CAN VISIT MY WEBSITE MENTIONED BELOW."]
[null,"8. Mark \"AB\" for Absent "]
[null,"FOR MORE QUERIES or SUGGESTIONS RING OR MAIL ME:"]
[]
[null,null,"Dr. SUNIL KUMAR VATS"]
[null,null,"9416266966, 9067892000"]
[null,null,"SUNILVATS1981@GMAIL.COM"]
[null,"YOU CAN ALSO DROP A MESSAGE ON MY WEBSITE:"]
[null,null,"www.sunilvats1981.wix.com/drskvats"]

{"sheet":"Student Profile","index":1,"n_rows":51,"n_cols":23,"rows_kept":51,"cut":false,"hidden":false,"merged":[[4,20,4,21],[4,13,5,13],[4,15,5,15],[4,16,4,17],[4,18,4,19],[4,14,5,14],[4,12,5,12],[3,0,3,2],[4,0,5,0],[4,1,5,1],[4,2,5,2],[4,3,5,3],[4,4,5,4],[4,5,5,5],[4,6,5,6],[4,7,5,7],[4,8,5,8],[4,9,5,9],[4,10,5,10],[4,11,5,11],[3,3,3,4],[1,0,1,2],[1,4,1,5],[0,0,0,2],[0,8,3,8],[0,9,3,13],[2,0,2,2],[2,3,2,7],[0,3,0,6],[3,6,3,7]]}
["Name of The School",null,null,{"$f":"Home!C7","v":"JAWAHAR NAVODAYA VIDYALAYA, "},null,null,null,{"$f":"Home!I7","v":"MOHINDERGARH"},"←","Subjects offered"]
["Affilation No.",null,null,540005,"Class & Sec",null,{"$f":"Home!C9","v":"XII A"},{"$f":"Home!C8","v":"2019-20"}]
["Complete Address",null,null,"VILL. KAREERA PO-KOTIA ,DISTT-MOHINDERGARH 123027"]
["CLASS TEACHER",null,null,{"$f":"Home!C11","v":"DR. SUNIL VATS"},null,"Email ID","jnvkareera2006@gmail.com"]
["SL.NO","AADHAR NO","NAME OF THE STUDENT","Adm. No","CONTACT NO","DOB \n(dd/mm/yyyy)","Mother Name","Father Name","HOUSE","LANG ","SUB 1/ LANG 2","SUB2","SUB 3","SUB 4","ADD. SUB","No of subjects","Term I",null,"Term II",null,"TOTAL",null,"%AGE"]
[null,null,null,null,null,null,null,null,null,null,null,null,null,null,null,null,"Total Attendance","No. of working days","Total Attendance","No. of working days","Total Attendance","No. of working days"]
[1,null,"SUNIL KUMAR",null,null,null,null,null,null,"ENGLISH","HINDI","Informatic Practices","MATH","BIO",null,{"$f":"COUNTIF(J7:O7,\">A\")","v":5},null,null,null,null,{"$f":"IF(OR(ISNUMBER(Q7),ISNUMBER(S7)),Q7+S7,\"\")","v":""},{"$f":"IF(OR(ISNUMBER(R7),ISNUMBER(T7)),R7+T7,\"\")","v":""},{"$f":"IF(ISNUMBER(U7),U7/V7*100,\"\")","v":""}]
[{"$f":"IF(C8>0,A7+1,\"\")","v":""},null,null,null,null,null,null,"f",null,"ENGLISH","HINDI","Informatic Practices","MATH","BIO",null,{"$f":"COUNTIF(J8:O8,\">A\")","v":5},null,null,null,null,{"$f":"IF(OR(ISNUMBER(Q8),ISNUMBER(S8)),Q8+S8,\"\")","v":""},{"$f":"IF(OR(ISNUMBER(R8),ISNUMBER(T8)),R8+T8,\"\")","v":""},{"$f":"IF(ISNUMBER(U8),U8/V8*100,\"\")","v":""}]
[{"$f":"IF(C9>0,A8+1,\"\")","v":""},null,null,null,null,null,null,null,null,"ENGLISH","HINDI","Informatic Practices","MATH","BIO",null,5,null,null,null,null,"","",""]
["",null,null,null,null,null,null,null,null,"ENGLISH","HINDI","Informatic Practices","MATH","BIO",null,5,null,null,null,null,"","",""]
["",null,null,null,null,null,null,null,null,"ENGLISH","HINDI","Informatic Practices","MATH","BIO",null,5,null,null,null,null,"","",""]
["",null,null,null,null,null,null,null,null,"ENGLISH","HINDI","Informatic Practices","MATH","BIO",null,5,null,null,null,null,"","",""]
["",null,null,null,null,null,null,null,null,"ENGLISH","HINDI","Informatic Practices","MATH","BIO",null,5,null,null,null,null,"","",""]
["",null,null,null,null,null,null,null,null,"ENGLISH","HINDI","Informatic Practices","MATH","BIO",null,5,null,null,null,null,"","",""]
["",null,null,null,null,null,null,null,null,"ENGLISH","HINDI","Informatic Practices","MATH","BIO",null,5,null,null,null,null,"","",""]
["",null,null,null,null,null,null,null,null,"ENGLISH","HINDI","Informatic Practices","MATH","BIO",null,5,null,null,null,null,"","",""]
["",null,null,null,null,null,null,null,null,"ENGLISH","HINDI","Informatic Practices","MATH","BIO",null,5,null,null,null,null,"","",""]
["",null,null,null,null,null,null,null,null,"ENGLISH","HINDI","Informatic Practices","MATH","BIO",null,5,null,null,null,null,"","",""]
["",null,null,null,null,null,null,null,null,"ENGLISH","HINDI","Informatic Practices","MATH","BIO",null,5,null,null,null,null,"","",""]
["",null,null,null,null,null,null,null,null,"ENGLISH","HINDI","Informatic Practices","MATH","BIO",null,5,null,null,null,null,"","",""]
["",null,null,null,null,null,null,null,null,"ENGLISH","HINDI","Informatic Practices","MATH","BIO",null,5,null,null,null,null,"","",""]
["",null,null,null,null,null,null,null,null,"ENGLISH","HINDI","Informatic Practices","MATH","BIO",null,5,null,null,null,null,"","",""]
["",null,null,null,null,null,null,null,null,"ENGLISH","HINDI","Informatic Practices","MATH","BIO",null,5,null,null,null,null,"","",""]
["",null,null,null,null,null,null,null,null,"ENGLISH","HINDI","Informatic Practices","MATH","BIO",null,5,null,null,null,null,"","",""]
["",null,null,null,null,null,null,null,null,"ENGLISH","HINDI","Informatic Practices","MATH","BIO",null,5,null,null,null,null,"","",""]
["",null,null,null,null,null,null,null,null,"ENGLISH","HINDI","Informatic Practices","MATH","BIO",null,5,null,null,null,null,"","",""]
["",null,null,null,null,null,null,null,null,"ENGLISH","HINDI","Informatic Practices","MATH","BIO",null,5,null,null,null,null,"","",""]
["",null,null,null,null,null,null,null,null,"ENGLISH","HINDI","Informatic Practices","MATH","BIO",null,5,null,null,null,null,"","",""]
["",null,null,null,null,null,null,null,null,"ENGLISH","HINDI","Informatic Practices","MATH","BIO",null,5,null,null,null,null,"","",""]
["",null,null,null,null,null,null,null,null,"ENGLISH","HINDI","Informatic Practices","MATH","BIO",null,5,null,null,null,null,"","",""]
["",null,null,null,null,null,null,null,null,"ENGLISH","HINDI","Informatic Practices","MATH","BIO",null,5,null,null,null,null,"","",""]
["",null,null,null,null,null,null,null,null,"ENGLISH","HINDI","Informatic Practices","MATH","BIO",null,5,null,null,null,null,"","",""]
["",null,null,null,null,null,null,null,null,"ENGLISH","HINDI","Informatic Practices","MATH","BIO",null,5,null,null,null,null,"","",""]
["",null,null,null,null,null,null,null,null,"ENGLISH","HINDI","Informatic Practices","MATH","BIO",null,5,null,null,null,null,"","",""]
["",null,null,null,null,null,null,null,null,"ENGLISH","HINDI","Informatic Practices","MATH","BIO",null,5,null,null,null,null,"","",""]
["",null,null,null,null,null,null,null,null,"ENGLISH","HINDI","Informatic Practices","MATH","BIO",null,5,null,null,null,null,"","",""]
["",null,null,null,null,null,null,null,null,"ENGLISH","HINDI","Informatic Practices","MATH","BIO",null,5,null,null,null,null,"","",""]
["",null,null,null,null,null,null,null,null,"ENGLISH","HINDI","Informatic Practices","MATH","BIO",null,5,null,null,null,null,"","",""]
["",null,null,null,null,null,null,null,null,"ENGLISH","HINDI","Informatic Practices","MATH","BIO",null,5,null,null,null,null,"","",""]
["",null,null,null,null,null,null,null,null,"ENGLISH","HINDI","Informatic Practices","MATH","BIO",null,5,null,null,null,null,"","",""]
["",null,null,null,null,null,null,null,null,"ENGLISH","HINDI","Informatic Practices","MATH","BIO",null,5,null,null,null,null,"","",""]
["",null,null,null,null,null,null,null,null,"ENGLISH","HINDI","Informatic Practices","MATH","BIO",null,5,null,null,null,null,"","",""]
["",null,null,null,null,null,null,null,null,"ENGLISH","HINDI","Informatic Practices","MATH","BIO",null,5,null,null,null,null,"","",""]
["",null,null,null,null,null,null,null,null,"ENGLISH","HINDI","Informatic Practices","MATH","BIO",null,5,null,null,null,null,"","",""]
["",null,null,null,null,null,null,null,null,"ENGLISH","HINDI","Informatic Practices","MATH","BIO",null,5,null,null,null,null,"","",""]
["",null,null,null,null,null,null,null,null,"ENGLISH","HINDI","Informatic Practices","MATH","BIO",null,5,null,null,null,null,"","",""]
["",null,null,null,null,null,null,null,null,"ENGLISH","HINDI","Informatic Practices","MATH","BIO",null,5,null,null,null,null,"","",""]
["",null,null,null,null,null,null,null,null,"ENGLISH","HINDI","Informatic Practices","MATH","BIO",null,5,null,null,null,null,"","",""]
["",null,null,null,null,null,null,null,null,"ENGLISH","HINDI","Informatic Practices","MATH","BIO",null,5,null,null,null,null,"","",""]
["",null,null,null,null,null,null,null,null,"ENGLISH","HINDI","Informatic Practices","MATH","BIO",null,5,null,null,null,null,"","",""]
["",null,null,null,null,null,null,null,null,"ENGLISH","HINDI","Informatic Practices","MATH","BIO",null,5,null,null,null,null,"","",""]

{"sheet":"UT1","index":2,"n_rows":63,"n_cols":26,"rows_kept":63,"cut":false,"hidden":false,"merged":[[59,0,59,1],[59,2,59,4],[2,15,2,25],[62,0,62,1],[62,2,62,4],[61,0,61,1],[61,2,61,4],[60,0,60,1],[60,2,60,4],[4,2,4,3],[4,4,5,4],[4,5,4,6],[4,7,5,7],[56,0,56,1],[56,2,56,4],[55,0,55,1],[55,2,55,4],[58,0,58,1],[58,2,58,4],[57,0,57,1],[57,2,57,4],[4,16,5,16],[4,17,4,18],[4,19,5,19],[4,20,4,21],[1,0,1,25],[2,0,2,5],[2,6,2,14],[0,12,0,25],[52,23,55,23],[52,24,55,24],[52,25,55,25],[3,0,6,0],[3,1,6,1],[3,2,3,4],[0,0,0,11],[3,25,6,25],[52,0,52,1],[52,2,52,4],[3,23,6,23],[3,24,6,24],[54,0,54,1],[54,2,54,4],[53,0,53,1],[53,2,53,4],[4,22,5,22],[3,8,3,10],[3,5,3,7],[3,20,3,22],[3,17,3,19],[3,14,3,16],[3,11,3,13],[52,5,52,7],[53,5,53,7],[52,8,52,10],[53,8,53,10],[52,11,52,13],[53,11,53,13],[52,14,52,16],[53,14,53,16],[52,17,52,19],[53,17,53,19],[52,20,52,22],[53,20,53,22],[4,8,4,9],[4,10,5,10],[4,11,4,12],[4,13,5,13],[4,14,4,15],[54,5,54,7],[55,5,55,7],[56,5,56,7],[57,5,57,7],[58,5,58,7],[59,5,59,7],[60,5,60,7],[61,5,61,7],[62,5,62,7],[54,8,54,10],[55,8,55,10],[56,8,56,10],[57,8,57,10],[58,8,58,10],[59,8,59,10],[60,8,60,10],[61,8,61,10],[62,8,62,10],[54,11,54,13],[55,11,55,13],[56,11,56,13],[57,11,57,13],[58,11,58,13],[59,11,59,13],[60,11,60,13],[61,11,61,13],[62,11,62,13],[54,14,54,16],[55,14,55,16],[56,14,56,16],[57,14,57,16],[58,14,58,16],[59,14,59,16],[60,14,60,16],[61,14,61,16],[62,14,62,16],[54,17,54,19],[55,17,55,19],[56,17,56,19],[57,17,57,19],[58,17,58,19],[59,17,59,19],[60,17,60,19],[61,17,61,19],[62,17,62,19],[54,20,54,22],[55,20,55,22],[56,20,56,22],[57,20,57,22],[58,20,58,22],[59,20,59,22],[60,20,60,22],[61,20,61,22],[62,20,62,22]]}
[{"$f":"Home!C7","v":"JAWAHAR NAVODAYA VIDYALAYA, "},null,null,null,null,null,null,null,null,null,null,null,{"$f":"Home!I7","v":"MOHINDERGARH"}]
["Unit Test-1"]
[{"$f":"Home!C9","v":"XII A"},null,null,null,null,null,{"$f":"Home!C8","v":"2019-20"},null,null,null,null,null,null,null,null,"E"]
["ROLL NO.","STUDENT NAME",{"$f":"Home!B15","v":"ENGLISH"},null,null,{"$f":"Home!B16","v":"HINDI"},null,null,{"$f":"Home!B17","v":"INFO PRACT"},null,null,{"$f":"Home!B18","v":"MATH"},null,null,{"$f":"Home!B19","v":"CHEM"},null,null,{"$f":"Home!B20","v":"PHYSICS"},null,null,{"$f":"Home!B21","v":"BIO"},null,null,"MARKS \nOBT","%AGE","Rank"]
[null,null,"M.M",null,"%age","M.M",null,"%age","M.M",null,"%age","M.M",null,"%age","M.M",null,"%age","M.M",null,"%age","M.M",null,"%age"]
[null,null,"Th.","IA/ Prac.",null,"Th.","IA/ Prac.",null,"Th.","IA/ Prac.",null,"Th.","IA/ Prac.",null,"Th.","IA/ Prac.",null,"Th.","IA/ Prac.",null,"Th.","IA/ Prac."]
[null,null,40,20,100,70,30,100,40,20,100,40,20,100,40,20,100,40,20,100,40,20,100]
[{"$f":"'Student Profile'!A7","v":1},{"$f":"IF(('Student Profile'!C7)>0,'Student Profile'!C7,\"\")","v":"SUNIL KUMAR"},20,10,{"$f":"IF(OR(ISNUMBER(C8),ISNUMBER(D8)),ROUNDUP(SUM(C8:D8)/SUM($C$7,$D$7)*100,0),IF(C8=\"AB\",C8,\"\"))","v":50},70,10,{"$f":"IF(OR(ISNUMBER(F8),ISNUMBER(G8)),ROUNDUP(SUM(F8:G8)/SUM($F$7,$G$7)*100,0),IF(F8=\"AB\",F8,\"\"))","v":80},20,10,{"$f":"IF(OR(ISNUMBER(I8),ISNUMBER(J8)),ROUNDUP(SUM(I8:J8)/SUM($I$7,$J$7)*100,0),IF(I8=\"AB\",I8,\"\"))","v":50},20,10,{"$f":"IF(OR(ISNUMBER(L8),ISNUMBER(M8)),ROUNDUP(SUM(L8:M8)/SUM($L$7,$M$7)*100,0),IF(L8=\"AB\",L8,\"\"))","v":50},20,10,{"$f":"IF(OR(ISNUMBER(O8),ISNUMBER(P8)),ROUNDUP(SUM(O8:P8)/SUM($O$7,$P$7)*100,0),IF(O8=\"AB\",O8,\"\"))","v":50},20,10,{"$f":"IF(OR(ISNUMBER(R8),ISNUMBER(S8)),ROUNDUP(SUM(R8:S8)/SUM($R$7,$S$7)*100,0),IF(R8=\"AB\",R8,\"\"))","v":50},20,10,{"$f":"IF(OR(ISNUMBER(U8),ISNUMBER(V8)),ROUNDUP(SUM(U8:V8)/SUM($U$7,$V$7)*100,0),IF(U8=\"AB\",U8,\"\"))","v":50},{"$f":"IF(OR(ISNUMBER(E8),ISNUMBER(G8),ISNUMBER(J8),ISNUMBER(M8),ISNUMBER(P8),ISNUMBER(S8),ISNUMBER(V8)),SUM(E8,G8,J8,M8,P8,S8,V8),\"\")","v":110},{"$f":"IFERROR(X8/'Student Profile'!P7,\"\")","v":22},{"$f":"IFERROR(RANK(Y8,Y$8:Y$52,0),\"\")","v":42}]
[{"$f":"'Student Profile'!A8","v":""},{"$f":"IF(('Student Profile'!C8)>0,'Student Profile'!C8,\"\")","v":""},25,15,{"$f":"IF(OR(ISNUMBER(C9),ISNUMBER(D9)),ROUNDUP(SUM(C9:D9)/SUM($C$7,$D$7)*100,0),IF(C9=\"AB\",C9,\"\"))","v":67},25,15,{"$f":"IF(OR(ISNUMBER(F9),ISNUMBER(G9)),ROUNDUP(SUM(F9:G9)/SUM($F$7,$G$7)*100,0),IF(F9=\"AB\",F9,\"\"))","v":40},25,15,{"$f":"IF(OR(ISNUMBER(I9),ISNUMBER(J9)),ROUNDUP(SUM(I9:J9)/SUM($I$7,$J$7)*100,0),IF(I9=\"AB\",I9,\"\"))","v":67},25,15,{"$f":"IF(OR(ISNUMBER(L9),ISNUMBER(M9)),ROUNDUP(SUM(L9:M9)/SUM($L$7,$M$7)*100,0),IF(L9=\"AB\",L9,\"\"))","v":67},25,15,{"$f":"IF(OR(ISNUMBER(O9),ISNUMBER(P9)),ROUNDUP(SUM(O9:P9)/SUM($O$7,$P$7)*100,0),IF(O9=\"AB\",O9,\"\"))","v":67},25,15,{"$f":"IF(OR(ISNUMBER(R9),ISNUMBER(S9)),ROUNDUP(SUM(R9:S9)/SUM($R$7,$S$7)*100,0),IF(R9=\"AB\",R9,\"\"))","v":67},25,15,{"$f":"IF(OR(ISNUMBER(U9),ISNUMBER(V9)),ROUNDUP(SUM(U9:V9)/SUM($U$7,$V$7)*100,0),IF(U9=\"AB\",U9,\"\"))","v":67},{"$f":"IF(OR(ISNUMBER(E9),ISNUMBER(G9),ISNUMBER(J9),ISNUMBER(M9),ISNUMBER(P9),ISNUMBER(S9),ISNUMBER(V9)),SUM(E9,G9,J9,M9,P9,S9,V9),\"\")","v":157},{"$f":"IFERROR(X9/'Student Profile'!P8,\"\")","v":31.4},{"$f":"IF(ISNUMBER(Y9),RANK(X9,X$8:X$52,0),\"\")","v":32}]
[{"$f":"'Student Profile'!A9","v":""},{"$f":"IF(('Student Profile'!C9)>0,'Student Profile'!C9,\"\")","v":""},35,20,92,35,20,55,35,20,92,35,20,92,35,20,92,35,20,92,35,20,92,212,{"$f":"IFERROR(X10/'Student Profile'!P9,\"\")","v":42.4},1]
[{"$f":"'Student Profile'!A10","v":""},{"$f":"IF(('Student Profile'!C10)>0,'Student Profile'!C10,\"\")","v":""},25,17,70,25,17,42,25,17,70,25,17,70,25,17,70,25,17,70,25,17,70,172,{"$f":"IFERROR(X11/'Student Profile'!P10,\"\")","v":34.4},15]
[{"$f":"'Student Profile'!A11","v":""},{"$f":"IF(('Student Profile'!C11)>0,'Student Profile'!C11,\"\")","v":""},34,15,82,34,15,49,34,15,82,34,15,82,34,15,82,34,15,82,34,15,82,172,{"$f":"IFERROR(X12/'Student Profile'!P11,\"\")","v":34.4},15]
[{"$f":"'Student Profile'!A12","v":""},{"$f":"IF(('Student Profile'!C12)>0,'Student Profile'!C12,\"\")","v":""},36,15,85,36,15,51,36,15,85,36,15,85,36,15,85,36,15,85,36,15,85,175,{"$f":"IFERROR(X13/'Student Profile'!P12,\"\")","v":35},10]
[{"$f":"'Student Profile'!A13","v":""},{"$f":"IF(('Student Profile'!C13)>0,'Student Profile'!C13,\"\")","v":""},25,15,67,25,15,40,25,15,67,25,15,67,25,15,67,25,15,67,25,15,67,157,{"$f":"IFERROR(X14/'Student Profile'!P13,\"\")","v":31.4},32]
[{"$f":"'Student Profile'!A14","v":""},{"$f":"IF(('Student Profile'!C14)>0,'Student Profile'!C14,\"\")","v":""},34,15,82,34,15,49,34,15,82,34,15,82,34,15,82,34,15,82,34,15,82,172,{"$f":"IFERROR(X15/'Student Profile'!P14,\"\")","v":34.4},15]
[{"$f":"'Student Profile'!A15","v":""},{"$f":"IF(('Student Profile'!C15)>0,'Student Profile'!C15,\"\")","v":""},28,18,77,28,18,46,28,18,77,28,18,77,28,18,77,28,18,77,28,18,77,185,{"$f":"IFERROR(X16/'Student Profile'!P15,\"\")","v":37},5]
[{"$f":"'Student Profile'!A16","v":""},{"$f":"IF(('Student Profile'!C16)>0,'Student Profile'!C16,\"\")","v":""},29,15,74,29,15,44,29,15,74,29,15,74,29,15,74,29,15,74,29,15,74,164,{"$f":"IFERROR(X17/'Student Profile'!P16,\"\")","v":32.799999999999997},28]
[{"$f":"'Student Profile'!A17","v":""},{"$f":"IF(('Student Profile'!C17)>0,'Student Profile'!C17,\"\")","v":""},20,10,50,20,10,30,20,10,50,20,10,50,20,10,50,20,10,50,20,10,50,110,{"$f":"IFERROR(X18/'Student Profile'!P17,\"\")","v":22},42]
[{"$f":"'Student Profile'!A18","v":""},{"$f":"IF(('Student Profile'!C18)>0,'Student Profile'!C18,\"\")","v":""},25,15,67,25,15,40,25,15,67,25,15,67,25,15,67,25,15,67,25,15,67,157,{"$f":"IFERROR(X19/'Student Profile'!P18,\"\")","v":31.4},32]
[{"$f":"'Student Profile'!A19","v":""},{"$f":"IF(('Student Profile'!C19)>0,'Student Profile'!C19,\"\")","v":""},35,20,92,35,20,55,35,20,92,35,20,92,35,20,92,35,20,92,35,20,92,212,{"$f":"IFERROR(X20/'Student Profile'!P19,\"\")","v":42.4},1]
[{"$f":"'Student Profile'!A20","v":""},{"$f":"IF(('Student Profile'!C20)>0,'Student Profile'!C20,\"\")","v":""},25,17,70,25,17,42,25,17,70,25,17,70,25,17,70,25,17,70,25,17,70,172,{"$f":"IFERROR(X21/'Student Profile'!P20,\"\")","v":34.4},15]
[{"$f":"'Student Profile'!A21","v":""},{"$f":"IF(('Student Profile'!C21)>0,'Student Profile'!C21,\"\")","v":""},34,15,82,34,15,49,34,15,82,34,15,82,34,15,82,34,15,82,34,15,82,172,{"$f":"IFERROR(X22/'Student Profile'!P21,\"\")","v":34.4},15]
[{"$f":"'Student Profile'!A22","v":""},{"$f":"IF(('Student Profile'!C22)>0,'Student Profile'!C22,\"\")","v":""},36,15,85,36,15,51,36,15,85,36,15,85,36,15,85,36,15,85,36,15,85,175,{"$f":"IFERROR(X23/'Student Profile'!P22,\"\")","v":35},10]
[{"$f":"'Student Profile'!A23","v":""},{"$f":"IF(('Student Profile'!C23)>0,'Student Profile'!C23,\"\")","v":""},25,15,67,25,15,40,25,15,67,25,15,67,25,15,67,25,15,67,25,15,67,157,{"$f":"IFERROR(X24/'Student Profile'!P23,\"\")","v":31.4},32]
[{"$f":"'Student Profile'!A24","v":""},{"$f":"IF(('Student Profile'!C24)>0,'Student Profile'!C24,\"\")","v":""},34,15,82,34,15,49,34,15,82,34,15,82,34,15,82,34,15,82,34,15,82,172,{"$f":"IFERROR(X25/'Student Profile'!P24,\"\")","v":34.4},15]
[{"$f":"'Student Profile'!A25","v":""},{"$f":"IF(('Student Profile'!C25)>0,'Student Profile'!C25,\"\")","v":""},28,18,77,28,18,46,28,18,77,28,18,77,28,18,77,28,18,77,28,18,77,185,{"$f":"IFERROR(X26/'Student Profile'!P25,\"\")","v":37},5]
[{"$f":"'Student Profile'!A26","v":""},{"$f":"IF(('Student Profile'!C26)>0,'Student Profile'!C26,\"\")","v":""},29,15,74,29,15,44,29,15,74,29,15,74,29,15,74,29,15,74,29,15,74,164,{"$f":"IFERROR(X27/'Student Profile'!P26,\"\")","v":32.799999999999997},28]
[{"$f":"'Student Profile'!A27","v":""},{"$f":"IF(('Student Profile'!C27)>0,'Student Profile'!C27,\"\")","v":""},20,10,50,20,10,30,20,10,50,20,10,50,20,10,50,20,10,50,20,10,50,110,{"$f":"IFERROR(X28/'Student Profile'!P27,\"\")","v":22},42]
[{"$f":"'Student Profile'!A28","v":""},{"$f":"IF(('Student Profile'!C28)>0,'Student Profile'!C28,\"\")","v":""},25,15,67,25,15,40,25,15,67,25,15,67,25,15,67,25,15,67,25,15,67,157,{"$f":"IFERROR(X29/'Student Profile'!P28,\"\")","v":31.4},32]
[{"$f":"'Student Profile'!A29","v":""},{"$f":"IF(('Student Profile'!C29)>0,'Student Profile'!C29,\"\")","v":""},35,20,92,35,20,55,35,20,92,35,20,92,35,20,92,35,20,92,35,20,92,212,{"$f":"IFERROR(X30/'Student Profile'!P29,\"\")","v":42.4},1]
[{"$f":"'Student Profile'!A30","v":""},{"$f":"IF(('Student Profile'!C30)>0,'Student Profile'!C30,\"\")","v":""},25,17,70,25,17,42,25,17,70,25,17,70,25,17,70,25,17,70,25,17,70,172,{"$f":"IFERROR(X31/'Student Profile'!P30,\"\")","v":34.4},15]
[{"$f":"'Student Profile'!A31","v":""},{"$f":"IF(('Student Profile'!C31)>0,'Student Profile'!C31,\"\")","v":""},34,15,82,34,15,49,34,15,82,34,15,82,34,15,82,34,15,82,34,15,82,172,{"$f":"IFERROR(X32/'Student Profile'!P31,\"\")","v":34.4},15]
[{"$f":"'Student Profile'!A32","v":""},{"$f":"IF(('Student Profile'!C32)>0,'Student Profile'!C32,\"\")","v":""},36,15,85,36,15,51,36,15,85,36,15,85,36,15,85,36,15,85,36,15,85,175,{"$f":"IFERROR(X33/'Student Profile'!P32,\"\")","v":35},10]
[{"$f":"'Student Profile'!A33","v":""},{"$f":"IF(('Student Profile'!C33)>0,'Student Profile'!C33,\"\")","v":""},25,15,67,25,15,40,25,15,67,25,15,67,25,15,67,25,15,67,25,15,67,157,{"$f":"IFERROR(X34/'Student Profile'!P33,\"\")","v":31.4},32]
[{"$f":"'Student Profile'!A34","v":""},{"$f":"IF(('Student Profile'!C34)>0,'Student Profile'!C34,\"\")","v":""},34,15,82,34,15,49,34,15,82,34,15,82,34,15,82,34,15,82,34,15,82,172,{"$f":"IFERROR(X35/'Student Profile'!P34,\"\")","v":34.4},15]
[{"$f":"'Student Profile'!A35","v":""},{"$f":"IF(('Student Profile'!C35)>0,'Student Profile'!C35,\"\")","v":""},28,18,77,28,18,46,28,18,77,28,18,77,28,18,77,28,18,77,28,18,77,185,{"$f":"IFERROR(X36/'Student Profile'!P35,\"\")","v":37},5]
[{"$f":"'Student Profile'!A36","v":""},{"$f":"IF(('Student Profile'!C36)>0,'Student Profile'!C36,\"\")","v":""},29,15,74,29,15,44,29,15,74,29,15,74,29,15,74,29,15,74,29,15,74,164,{"$f":"IFERROR(X37/'Student Profile'!P36,\"\")","v":32.799999999999997},28]
[{"$f":"'Student Profile'!A37","v":""},{"$f":"IF(('Student Profile'!C37)>0,'Student Profile'!C37,\"\")","v":""},20,10,50,20,10,30,20,10,50,20,10,50,20,10,50,20,10,50,20,10,50,110,{"$f":"IFERROR(X38/'Student Profile'!P37,\"\")","v":22},42]
[{"$f":"'Student Profile'!A38","v":""},{"$f":"IF(('Student Profile'!C38)>0,'Student Profile'!C38,\"\")","v":""},25,15,67,25,15,40,25,15,67,25,15,67,25,15,67,25,15,67,25,15,67,157,{"$f":"IFERROR(X39/'Student Profile'!P38,\"\")","v":31.4},32]
[{"$f":"'Student Profile'!A39","v":""},{"$f":"IF(('Student Profile'!C39)>0,'Student Profile'!C39,\"\")","v":""},35,20,92,35,20,55,35,20,92,35,20,92,35,20,92,35,20,92,35,20,92,212,{"$f":"IFERROR(X40/'Student Profile'!P39,\"\")","v":42.4},1]
[{"$f":"'Student Profile'!A40","v":""},{"$f":"IF(('Student Profile'!C40)>0,'Student Profile'!C40,\"\")","v":""},25,17,70,25,17,42,25,17,70,25,17,70,25,17,70,25,17,70,25,17,70,172,{"$f":"IFERROR(X41/'Student Profile'!P40,\"\")","v":34.4},15]
[{"$f":"'Student Profile'!A41","v":""},{"$f":"IF(('Student Profile'!C41)>0,'Student Profile'!C41,\"\")","v":""},34,15,82,34,15,49,34,15,82,34,15,82,34,15,82,34,15,82,34,15,82,172,{"$f":"IFERROR(X42/'Student Profile'!P41,\"\")","v":34.4},15]
[{"$f":"'Student Profile'!A42","v":""},{"$f":"IF(('Student Profile'!C42)>0,'Student Profile'!C42,\"\")","v":""},36,15,85,36,15,51,36,15,85,36,15,85,36,15,85,36,15,85,36,15,85,175,{"$f":"IFERROR(X43/'Student Profile'!P42,\"\")","v":35},10]
[{"$f":"'Student Profile'!A43","v":""},{"$f":"IF(('Student Profile'!C43)>0,'Student Profile'!C43,\"\")","v":""},25,15,67,25,15,40,25,15,67,25,15,67,25,15,67,25,15,67,25,15,67,157,{"$f":"IFERROR(X44/'Student Profile'!P43,\"\")","v":31.4},32]
[{"$f":"'Student Profile'!A44","v":""},{"$f":"IF(('Student Profile'!C44)>0,'Student Profile'!C44,\"\")","v":""},34,15,82,34,15,49,34,15,82,34,15,82,34,15,82,34,15,82,34,15,82,172,{"$f":"IFERROR(X45/'Student Profile'!P44,\"\")","v":34.4},15]
[{"$f":"'Student Profile'!A45","v":""},{"$f":"IF(('Student Profile'!C45)>0,'Student Profile'!C45,\"\")","v":""},28,18,77,28,18,46,28,18,77,28,18,77,28,18,77,28,18,77,28,18,77,185,{"$f":"IFERROR(X46/'Student Profile'!P45,\"\")","v":37},5]
[{"$f":"'Student Profile'!A46","v":""},{"$f":"IF(('Student Profile'!C46)>0,'Student Profile'!C46,\"\")","v":""},29,15,74,29,15,44,29,15,74,29,15,74,29,15,74,29,15,74,29,15,74,164,{"$f":"IFERROR(X47/'Student Profile'!P46,\"\")","v":32.799999999999997},28]
[{"$f":"'Student Profile'!A47","v":""},{"$f":"IF(('Student Profile'!C47)>0,'Student Profile'!C47,\"\")","v":""},36,15,85,36,15,51,36,15,85,36,15,85,36,15,85,36,15,85,36,15,85,175,{"$f":"IFERROR(X48/'Student Profile'!P47,\"\")","v":35},10]
[{"$f":"'Student Profile'!A48","v":""},{"$f":"IF(('Student Profile'!C48)>0,'Student Profile'!C48,\"\")","v":""},25,15,67,25,15,40,25,15,67,25,15,67,25,15,67,25,15,67,25,15,67,157,{"$f":"IFERROR(X49/'Student Profile'!P48,\"\")","v":31.4},32]
[{"$f":"'Student Profile'!A49","v":""},{"$f":"IF(('Student Profile'!C49)>0,'Student Profile'!C49,\"\")","v":""},34,15,82,34,15,49,34,15,82,34,15,82,34,15,82,34,15,82,34,15,82,172,{"$f":"IFERROR(X50/'Student Profile'!P49,\"\")","v":34.4},15]
[{"$f":"'Student Profile'!A50","v":""},{"$f":"IF(('Student Profile'!C50)>0,'Student Profile'!C50,\"\")","v":""},28,18,77,28,18,46,28,18,77,28,18,77,28,18,77,28,18,77,28,18,77,185,{"$f":"IFERROR(X51/'Student Profile'!P50,\"\")","v":37},5]
[{"$f":"'Student Profile'!A51","v":""},{"$f":"IF(('Student Profile'!C51)>0,'Student Profile'!C51,\"\")","v":""},"AB",12,20,"AB",12,12,"AB",12,20,"AB",12,20,"AB",12,20,"AB",12,20,"AB",12,20,{"$f":"IF(OR(ISNUMBER(E52),ISNUMBER(H52),ISNUMBER(K52),ISNUMBER(N52),ISNUMBER(Q52),ISNUMBER(T52),ISNUMBER(W52)),SUM(E52,H52,K52,N52,Q52,T52,Q52),\"\")","v":132},{"$f":"IFERROR(X52/'Student Profile'!P51,\"\")","v":26.4},41]
["Subject Avg.",null,{"$f":"IF(AND(ISNUMBER(Z57),Z57>0),SUM(E8:E52)/C60,\"\")","v":73.666666666666671},null,null,{"$f":"IF(AND(ISNUMBER(Z58),Z58>0),SUM(H8:H52)/F60,\"\")","v":45.155555555555559},null,null,{"$f":"IF(AND(ISNUMBER(Z59),Z59>0),SUM(K8:K52)/I60,\"\")","v":73.666666666666671},null,null,{"$f":"IF(AND(ISNUMBER(Z60),Z60>0),SUM(N8:N52)/L60,\"\")","v":73.666666666666671},null,null,{"$f":"IF(AND(ISNUMBER(Z61),Z61>0),SUM(Q8:Q52)/O60,\"\")","v":73.666666666666671},null,null,{"$f":"IF(AND(ISNUMBER(Z62),Z62>0),SUM(T8:T52)/R60,\"\")","v":73.666666666666671},null,null,{"$f":"IF(AND(ISNUMBER(AO58),AO58>0),SUM(W8:W52)/U60,\"\")","v":""},null,null,"SUBJECTS","Total Student","Present"]
["Pass %age",null,{"$f":"IF(ISNUMBER(C53),(C61/C60)*100,\"0\")","v":97.777777777777771},null,null,{"$f":"IF(ISNUMBER(F53),F61/F60*100,\"0\")","v":91.111111111111114},null,null,{"$f":"IF(ISNUMBER(I53),I61/I60*100,\"0\")","v":97.777777777777771},null,null,{"$f":"IF(ISNUMBER(L53),L61/L60*100,\"0\")","v":97.777777777777771},null,null,{"$f":"IF(ISNUMBER(O53),O61/O60*100,\"0\")","v":97.777777777777771},null,null,{"$f":"IF(ISNUMBER(R53),R61/R60*100,\"0\")","v":97.777777777777771},null,null,{"$f":"IF(ISNUMBER(U53),U61/U60*100,\"0\")","v":"0"}]
["Below 33%",null,{"$f":"COUNTIF(E8:E52,\"<33\")","v":1},null,null,{"$f":"COUNTIF(H8:H52,\"<33\")","v":4},null,null,{"$f":"COUNTIF(K8:K52,\"<33\")","v":1},null,null,{"$f":"COUNTIF(N8:N52,\"<33\")","v":1},null,null,{"$f":"COUNTIF(Q8:Q52,\"<33\")","v":1},null,null,{"$f":"COUNTIF(T8:T52,\"<33\")","v":1},null,null,{"$f":"COUNTIF(V8:V52,\"<33\")","v":45}]
["33% to 50%",null,{"$f":"COUNTIF(E8:E52,\">=33\")-C57-C58-C59","v":0},null,null,{"$f":"COUNTIF(H8:H52,\">=33\")-F57-F58-F59","v":31},null,null,{"$f":"COUNTIF(K8:K52,\">=33\")-I57-I58-I59","v":0},null,null,{"$f":"COUNTIF(N8:N52,\">=33\")-L57-L58-L59","v":0},null,null,{"$f":"COUNTIF(Q8:Q52,\">=33\")-O57-O58-O59","v":0},null,null,{"$f":"COUNTIF(T8:T52,\">=33\")-R57-R58-R59","v":0},null,null,{"$f":"COUNTIF(W8:W52,\">=33\")-U57-U58-U59","v":0}]
["50% to 60%",null,{"$f":"COUNTIF(E8:E52,\">=50\")-C58-C59","v":4},null,null,{"$f":"COUNTIF(H8:H52,\">=50\")-F58-F59","v":9},null,null,{"$f":"COUNTIF(K8:K52,\">=50\")-I58-I59","v":4},null,null,{"$f":"COUNTIF(N8:N52,\">=50\")-L58-L59","v":4},null,null,{"$f":"COUNTIF(Q8:Q52,\">=50\")-O58-O59","v":4},null,null,{"$f":"COUNTIF(T8:T52,\">=50\")-R58-R59","v":4},null,null,{"$f":"COUNTIF(W8:W52,\">=50\")-U58-U59","v":4},null,null,{"$f":"Home!B15","v":"ENGLISH"},{"$f":"C62","v":45},{"$f":"C60","v":45}]
["60% to 75%",null,{"$f":"COUNTIF(E8:E52,\">=60\")-C59","v":17},null,null,{"$f":"COUNTIF(H8:H52,\">=60\")-F59","v":0},null,null,{"$f":"COUNTIF(K8:K52,\">=60\")-I59","v":17},null,null,{"$f":"COUNTIF(N8:N52,\">=60\")-L59","v":17},null,null,{"$f":"COUNTIF(Q8:Q52,\">=60\")-O59","v":17},null,null,{"$f":"COUNTIF(T8:T52,\">=60\")-R59","v":17},null,null,{"$f":"COUNTIF(W8:W52,\">=60\")-U59","v":17},null,null,{"$f":"Home!B16","v":"HINDI"},{"$f":"F62","v":45},{"$f":"F60","v":45}]
["above 75%",null,{"$f":"COUNTIF(E8:E52,\">=75\")","v":23},null,null,{"$f":"COUNTIF(H8:H52,\">=75\")","v":1},null,null,{"$f":"COUNTIF(K8:K52,\">=75\")","v":23},null,null,{"$f":"COUNTIF(N8:N52,\">=75\")","v":23},null,null,{"$f":"COUNTIF(Q8:Q52,\">=75\")","v":23},null,null,{"$f":"COUNTIF(T8:T52,\">=75\")","v":23},null,null,{"$f":"COUNTIF(W8:W52,\">=75\")","v":23},null,null,{"$f":"Home!B17","v":"INFO PRACT"},{"$f":"I62","v":45},{"$f":"I60","v":45}]
["Appeared",null,{"$f":"COUNTIF(E8:E52,\">=0\")","v":45},null,null,{"$f":"COUNTIF(H8:H52,\">=0\")","v":45},null,null,{"$f":"COUNTIF(K8:K52,\">=0\")","v":45},null,null,{"$f":"COUNTIF(N8:N52,\">=0\")","v":45},null,null,{"$f":"COUNTIF(Q8:Q52,\">=0\")","v":45},null,null,{"$f":"COUNTIF(T8:T52,\">=0\")","v":45},null,null,{"$f":"COUNTIF(W8:W52,\">=0\")","v":45},null,null,{"$f":"Home!B18","v":"MATH"},{"$f":"L62","v":45},{"$f":"L60","v":45}]
["Passed",null,{"$f":"COUNTIF(E8:E52,\">=33\")","v":44},null,null,{"$f":"COUNTIF(H8:H52,\">=33\")","v":41},null,null,{"$f":"COUNTIF(K8:K52,\">=33\")","v":44},null,null,{"$f":"COUNTIF(N8:N52,\">=33\")","v":44},null,null,{"$f":"COUNTIF(Q8:Q52,\">=33\")","v":44},null,null,{"$f":"COUNTIF(T8:T52,\">=33\")","v":44},null,null,{"$f":"COUNTIF(W8:W52,\">=33\")","v":44},null,null,{"$f":"Home!B19","v":"CHEM"},{"$f":"O62","v":45},{"$f":"O60","v":45}]
["Total",null,{"$f":"C60+C63","v":45},null,null,{"$f":"F60+F63","v":45},null,null,{"$f":"I60+I63","v":45},null,null,{"$f":"L60+L63","v":45},null,null,{"$f":"O60+O63","v":45},null,null,{"$f":"R60+R63","v":45},null,null,{"$f":"U60+U63","v":45},null,null,{"$f":"Home!B20","v":"PHYSICS"},{"$f":"R62","v":45},{"$f":"R60","v":45}]
["Absent",null,{"$f":"COUNTIF(E8:E52,\"AB\")","v":0},null,null,{"$f":"COUNTIF(H8:H52,\"AB\")","v":0},null,null,{"$f":"COUNTIF(J8:J52,\"AB\")","v":0},null,null,{"$f":"COUNTIF(N8:N52,\"AB\")","v":0},null,null,{"$f":"COUNTIF(Q8:Q52,\"AB\")","v":0},null,null,{"$f":"COUNTIF(T8:T52,\"AB\")","v":0},null,null,{"$f":"COUNTIF(W8:W52,\"AB\")","v":0},null,null,{"$f":"Home!B21","v":"BIO"},{"$f":"U62","v":45},{"$f":"U60","v":45}]

{"sheet":"UT 2","index":3,"n_rows":63,"n_cols":26,"rows_kept":63,"cut":false,"hidden":false,"merged":[[62,0,62,1],[62,2,62,4],[62,5,62,7],[62,8,62,10],[62,11,62,13],[62,14,62,16],[62,17,62,19],[62,20,62,22],[60,2,60,4],[60,5,60,7],[60,8,60,10],[60,11,60,13],[60,14,60,16],[60,17,60,19],[60,20,60,22],[61,2,61,4],[61,5,61,7],[61,8,61,10],[61,11,61,13],[61,14,61,16],[61,17,61,19],[61,20,61,22],[58,17,58,19],[58,20,58,22],[59,2,59,4],[59,5,59,7],[59,8,59,10],[59,11,59,13],[59,14,59,16],[59,17,59,19],[59,20,59,22],[56,17,56,19],[56,20,56,22],[57,2,57,4],[57,5,57,7],[57,8,57,10],[57,11,57,13],[57,14,57,16],[57,17,57,19],[57,20,57,22],[52,25,55,25],[53,2,53,4],[53,5,53,7],[53,8,53,10],[53,11,53,13],[53,14,53,16],[53,17,53,19],[53,20,53,22],[54,2,54,4],[54,5,54,7],[54,8,54,10],[54,11,54,13],[54,14,54,16],[54,17,54,19],[54,20,54,22],[55,2,55,4],[55,5,55,7],[55,8,55,10],[55,11,55,13],[55,14,55,16],[55,17,55,19],[55,20,55,22],[52,2,52,4],[52,5,52,7],[52,8,52,10],[52,11,52,13],[52,14,52,16],[52,17,52,19],[52,20,52,22],[52,23,55,23],[52,24,55,24],[3,23,6,23],[3,24,6,24],[3,25,6,25],[4,2,4,3],[4,4,5,4],[4,5,4,6],[4,7,5,7],[4,8,4,9],[4,10,5,10],[4,11,4,12],[4,13,5,13],[4,14,4,15],[4,16,5,16],[4,17,4,18],[4,19,5,19],[4,20,4,21],[4,22,5,22],[3,0,6,0],[3,1,6,1],[3,2,3,4],[3,5,3,7],[3,8,3,10],[3,11,3,13],[3,14,3,16],[3,17,3,19],[3,20,3,22],[0,0,0,11],[0,12,0,25],[1,0,1,25],[2,0,2,5],[2,6,2,14],[2,15,2,25],[52,0,52,1],[53,0,53,1],[54,0,54,1],[56,0,56,1],[55,0,55,1],[56,2,56,4],[56,5,56,7],[56,8,56,10],[56,11,56,13],[56,14,56,16],[58,0,58,1],[57,0,57,1],[58,2,58,4],[58,5,58,7],[58,8,58,10],[58,11,58,13],[58,14,58,16],[61,0,61,1],[60,0,60,1],[59,0,59,1]]}
[{"$f":"Home!C7","v":"JAWAHAR NAVODAYA VIDYALAYA, "},null,null,null,null,null,null,null,null,null,null,null,{"$f":"Home!I7","v":"MOHINDERGARH"}]
["Unit Test-2"]
[{"$f":"Home!C9","v":"XII A"},null,null,null,null,null,{"$f":"Home!C8","v":"2019-20"},null,null,null,null,null,null,null,null,"E"]
["ROLL NO.","STUDENT NAME",{"$f":"Home!B15","v":"ENGLISH"},null,null,{"$f":"Home!B16","v":"HINDI"},null,null,{"$f":"Home!B17","v":"INFO PRACT"},null,null,{"$f":"Home!B18","v":"MATH"},null,null,{"$f":"Home!B19","v":"CHEM"},null,null,{"$f":"Home!B20","v":"PHYSICS"},null,null,{"$f":"Home!B21","v":"BIO"},null,null,"MARKS \nOBT","%AGE","Rank"]
[null,null,"M.M",null,"%age","M.M",null,"%age","M.M",null,"%age","M.M",null,"%age","M.M",null,"%age","M.M",null,"%age","M.M",null,"%age"]
[null,null,"Th.","IA/ Prac.",null,"Th.","IA/ Prac.",null,"Th.","IA/ Prac.",null,"Th.","IA/ Prac.",null,"Th.","IA/ Prac.",null,"Th.","IA/ Prac.",null,"Th.","IA/ Prac."]
[null,null,40,20,100,40,20,100,40,20,100,40,20,100,40,20,100,40,20,100,40,20,100]
[{"$f":"'Student Profile'!A7","v":1},{"$f":"IF(('Student Profile'!C7)>0,'Student Profile'!C7,\"\")","v":"SUNIL KUMAR"},20,10,{"$f":"IF(OR(ISNUMBER(C8),ISNUMBER(D8)),ROUNDUP(SUM(C8:D8)/SUM($C$7,$D$7)*100,0),IF(C8=\"AB\",C8,\"\"))","v":50},20,10,{"$f":"IF(OR(ISNUMBER(F8),ISNUMBER(G8)),ROUNDUP(SUM(F8:G8)/SUM($F$7,$G$7)*100,0),IF(F8=\"AB\",F8,\"\"))","v":50},20,10,{"$f":"IF(OR(ISNUMBER(I8),ISNUMBER(J8)),ROUNDUP(SUM(I8:J8)/SUM($I$7,$J$7)*100,0),IF(I8=\"AB\",I8,\"\"))","v":50},20,10,{"$f":"IF(OR(ISNUMBER(L8),ISNUMBER(M8)),ROUNDUP(SUM(L8:M8)/SUM($L$7,$M$7)*100,0),IF(L8=\"AB\",L8,\"\"))","v":50},20,10,{"$f":"IF(OR(ISNUMBER(O8),ISNUMBER(P8)),ROUNDUP(SUM(O8:P8)/SUM($O$7,$P$7)*100,0),IF(O8=\"AB\",O8,\"\"))","v":50},20,10,{"$f":"IF(OR(ISNUMBER(R8),ISNUMBER(S8)),ROUNDUP(SUM(R8:S8)/SUM($R$7,$S$7)*100,0),IF(R8=\"AB\",R8,\"\"))","v":50},20,10,{"$f":"IF(OR(ISNUMBER(U8),ISNUMBER(V8)),ROUNDUP(SUM(U8:V8)/SUM($U$7,$V$7)*100,0),IF(U8=\"AB\",U8,\"\"))","v":50},{"$f":"IF(OR(ISNUMBER(E8),ISNUMBER(G8),ISNUMBER(J8),ISNUMBER(M8),ISNUMBER(P8),ISNUMBER(S8),ISNUMBER(V8)),SUM(E8,G8,J8,M8,P8,S8,V8),\"\")","v":110},{"$f":"IFERROR(X8/'Student Profile'!P7,\"\")","v":22},{"$f":"IFERROR(RANK(Y8,Y$8:Y$52,0),\"\")","v":42}]
[{"$f":"'Student Profile'!A8","v":""},{"$f":"IF(('Student Profile'!C8)>0,'Student Profile'!C8,\"\")","v":""},25,15,{"$f":"IF(OR(ISNUMBER(C9),ISNUMBER(D9)),ROUNDUP(SUM(C9:D9)/SUM($C$7,$D$7)*100,0),IF(C9=\"AB\",C9,\"\"))","v":67},25,15,{"$f":"IF(OR(ISNUMBER(F9),ISNUMBER(G9)),ROUNDUP(SUM(F9:G9)/SUM($F$7,$G$7)*100,0),IF(F9=\"AB\",F9,\"\"))","v":67},25,15,{"$f":"IF(OR(ISNUMBER(I9),ISNUMBER(J9)),ROUNDUP(SUM(I9:J9)/SUM($I$7,$J$7)*100,0),IF(I9=\"AB\",I9,\"\"))","v":67},25,15,{"$f":"IF(OR(ISNUMBER(L9),ISNUMBER(M9)),ROUNDUP(SUM(L9:M9)/SUM($L$7,$M$7)*100,0),IF(L9=\"AB\",L9,\"\"))","v":67},25,15,{"$f":"IF(OR(ISNUMBER(O9),ISNUMBER(P9)),ROUNDUP(SUM(O9:P9)/SUM($O$7,$P$7)*100,0),IF(O9=\"AB\",O9,\"\"))","v":67},25,15,{"$f":"IF(OR(ISNUMBER(R9),ISNUMBER(S9)),ROUNDUP(SUM(R9:S9)/SUM($R$7,$S$7)*100,0),IF(R9=\"AB\",R9,\"\"))","v":67},25,15,{"$f":"IF(OR(ISNUMBER(U9),ISNUMBER(V9)),ROUNDUP(SUM(U9:V9)/SUM($U$7,$V$7)*100,0),IF(U9=\"AB\",U9,\"\"))","v":67},{"$f":"IF(OR(ISNUMBER(E9),ISNUMBER(G9),ISNUMBER(J9),ISNUMBER(M9),ISNUMBER(P9),ISNUMBER(S9),ISNUMBER(V9)),SUM(E9,G9,J9,M9,P9,S9,V9),\"\")","v":157},{"$f":"IFERROR(X9/'Student Profile'!P8,\"\")","v":31.4},{"$f":"IF(ISNUMBER(Y9),RANK(X9,X$8:X$52,0),\"\")","v":32}]
[{"$f":"'Student Profile'!A9","v":""},{"$f":"IF(('Student Profile'!C9)>0,'Student Profile'!C9,\"\")","v":""},35,20,92,35,20,92,35,20,92,35,20,92,35,20,92,35,20,92,35,20,92,212,{"$f":"IFERROR(X10/'Student Profile'!P9,\"\")","v":42.4},1]
[{"$f":"'Student Profile'!A10","v":""},{"$f":"IF(('Student Profile'!C10)>0,'Student Profile'!C10,\"\")","v":""},25,17,70,25,17,70,25,17,70,25,17,70,25,17,70,25,17,70,25,17,70,172,{"$f":"IFERROR(X11/'Student Profile'!P10,\"\")","v":34.4},15]
[{"$f":"'Student Profile'!A11","v":""},{"$f":"IF(('Student Profile'!C11)>0,'Student Profile'!C11,\"\")","v":""},34,15,82,34,15,82,34,15,82,34,15,82,34,15,82,34,15,82,34,15,82,172,{"$f":"IFERROR(X12/'Student Profile'!P11,\"\")","v":34.4},15]
[{"$f":"'Student Profile'!A12","v":""},{"$f":"IF(('Student Profile'!C12)>0,'Student Profile'!C12,\"\")","v":""},36,15,85,36,15,85,36,15,85,36,15,85,36,15,85,36,15,85,36,15,85,175,{"$f":"IFERROR(X13/'Student Profile'!P12,\"\")","v":35},10]
[{"$f":"'Student Profile'!A13","v":""},{"$f":"IF(('Student Profile'!C13)>0,'Student Profile'!C13,\"\")","v":""},25,15,67,25,15,67,25,15,67,25,15,67,25,15,67,25,15,67,25,15,67,157,{"$f":"IFERROR(X14/'Student Profile'!P13,\"\")","v":31.4},32]
[{"$f":"'Student Profile'!A14","v":""},{"$f":"IF(('Student Profile'!C14)>0,'Student Profile'!C14,\"\")","v":""},34,15,82,34,15,82,34,15,82,34,15,82,34,15,82,34,15,82,34,15,82,172,{"$f":"IFERROR(X15/'Student Profile'!P14,\"\")","v":34.4},15]
[{"$f":"'Student Profile'!A15","v":""},{"$f":"IF(('Student Profile'!C15)>0,'Student Profile'!C15,\"\")","v":""},28,18,77,28,18,77,28,18,77,28,18,77,28,18,77,28,18,77,28,18,77,185,{"$f":"IFERROR(X16/'Student Profile'!P15,\"\")","v":37},5]
[{"$f":"'Student Profile'!A16","v":""},{"$f":"IF(('Student Profile'!C16)>0,'Student Profile'!C16,\"\")","v":""},29,15,74,29,15,74,29,15,74,29,15,74,29,15,74,29,15,74,29,15,74,164,{"$f":"IFERROR(X17/'Student Profile'!P16,\"\")","v":32.799999999999997},28]
[{"$f":"'Student Profile'!A17","v":""},{"$f":"IF(('Student Profile'!C17)>0,'Student Profile'!C17,\"\")","v":""},20,10,50,20,10,50,20,10,50,20,10,50,20,10,50,20,10,50,20,10,50,110,{"$f":"IFERROR(X18/'Student Profile'!P17,\"\")","v":22},42]
[{"$f":"'Student Profile'!A18","v":""},{"$f":"IF(('Student Profile'!C18)>0,'Student Profile'!C18,\"\")","v":""},25,15,67,25,15,67,25,15,67,25,15,67,25,15,67,25,15,67,25,15,67,157,{"$f":"IFERROR(X19/'Student Profile'!P18,\"\")","v":31.4},32]
[{"$f":"'Student Profile'!A19","v":""},{"$f":"IF(('Student Profile'!C19)>0,'Student Profile'!C19,\"\")","v":""},35,20,92,35,20,92,35,20,92,35,20,92,35,20,92,35,20,92,35,20,92,212,{"$f":"IFERROR(X20/'Student Profile'!P19,\"\")","v":42.4},1]
[{"$f":"'Student Profile'!A20","v":""},{"$f":"IF(('Student Profile'!C20)>0,'Student Profile'!C20,\"\")","v":""},25,17,70,25,17,70,25,17,70,25,17,70,25,17,70,25,17,70,25,17,70,172,{"$f":"IFERROR(X21/'Student Profile'!P20,\"\")","v":34.4},15]
[{"$f":"'Student Profile'!A21","v":""},{"$f":"IF(('Student Profile'!C21)>0,'Student Profile'!C21,\"\")","v":""},34,15,82,34,15,82,34,15,82,34,15,82,34,15,82,34,15,82,34,15,82,172,{"$f":"IFERROR(X22/'Student Profile'!P21,\"\")","v":34.4},15]
[{"$f":"'Student Profile'!A22","v":""},{"$f":"IF(('Student Profile'!C22)>0,'Student Profile'!C22,\"\")","v":""},36,15,85,36,15,85,36,15,85,36,15,85,36,15,85,36,15,85,36,15,85,175,{"$f":"IFERROR(X23/'Student Profile'!P22,\"\")","v":35},10]
[{"$f":"'Student Profile'!A23","v":""},{"$f":"IF(('Student Profile'!C23)>0,'Student Profile'!C23,\"\")","v":""},25,15,67,25,15,67,25,15,67,25,15,67,25,15,67,25,15,67,25,15,67,157,{"$f":"IFERROR(X24/'Student Profile'!P23,\"\")","v":31.4},32]
[{"$f":"'Student Profile'!A24","v":""},{"$f":"IF(('Student Profile'!C24)>0,'Student Profile'!C24,\"\")","v":""},34,15,82,34,15,82,34,15,82,34,15,82,34,15,82,34,15,82,34,15,82,172,{"$f":"IFERROR(X25/'Student Profile'!P24,\"\")","v":34.4},15]
[{"$f":"'Student Profile'!A25","v":""},{"$f":"IF(('Student Profile'!C25)>0,'Student Profile'!C25,\"\")","v":""},28,18,77,28,18,77,28,18,77,28,18,77,28,18,77,28,18,77,28,18,77,185,{"$f":"IFERROR(X26/'Student Profile'!P25,\"\")","v":37},5]
[{"$f":"'Student Profile'!A26","v":""},{"$f":"IF(('Student Profile'!C26)>0,'Student Profile'!C26,\"\")","v":""},29,15,74,29,15,74,29,15,74,29,15,74,29,15,74,29,15,74,29,15,74,164,{"$f":"IFERROR(X27/'Student Profile'!P26,\"\")","v":32.799999999999997},28]
[{"$f":"'Student Profile'!A27","v":""},{"$f":"IF(('Student Profile'!C27)>0,'Student Profile'!C27,\"\")","v":""},20,10,50,20,10,50,20,10,50,20,10,50,20,10,50,20,10,50,20,10,50,110,{"$f":"IFERROR(X28/'Student Profile'!P27,\"\")","v":22},42]
[{"$f":"'Student Profile'!A28","v":""},{"$f":"IF(('Student Profile'!C28)>0,'Student Profile'!C28,\"\")","v":""},25,15,67,25,15,67,25,15,67,25,15,67,25,15,67,25,15,67,25,15,67,157,{"$f":"IFERROR(X29/'Student Profile'!P28,\"\")","v":31.4},32]
[{"$f":"'Student Profile'!A29","v":""},{"$f":"IF(('Student Profile'!C29)>0,'Student Profile'!C29,\"\")","v":""},35,20,92,35,20,92,35,20,92,35,20,92,35,20,92,35,20,92,35,20,92,212,{"$f":"IFERROR(X30/'Student Profile'!P29,\"\")","v":42.4},1]
[{"$f":"'Student Profile'!A30","v":""},{"$f":"IF(('Student Profile'!C30)>0,'Student Profile'!C30,\"\")","v":""},25,17,70,25,17,70,25,17,70,25,17,70,25,17,70,25,17,70,25,17,70,172,{"$f":"IFERROR(X31/'Student Profile'!P30,\"\")","v":34.4},15]
[{"$f":"'Student Profile'!A31","v":""},{"$f":"IF(('Student Profile'!C31)>0,'Student Profile'!C31,\"\")","v":""},34,15,82,34,15,82,34,15,82,34,15,82,34,15,82,34,15,82,34,15,82,172,{"$f":"IFERROR(X32/'Student Profile'!P31,\"\")","v":34.4},15]
[{"$f":"'Student Profile'!A32","v":""},{"$f":"IF(('Student Profile'!C32)>0,'Student Profile'!C32,\"\")","v":""},36,15,85,36,15,85,36,15,85,36,15,85,36,15,85,36,15,85,36,15,85,175,{"$f":"IFERROR(X33/'Student Profile'!P32,\"\")","v":35},10]
[{"$f":"'Student Profile'!A33","v":""},{"$f":"IF(('Student Profile'!C33)>0,'Student Profile'!C33,\"\")","v":""},25,15,67,25,15,67,25,15,67,25,15,67,25,15,67,25,15,67,25,15,67,157,{"$f":"IFERROR(X34/'Student Profile'!P33,\"\")","v":31.4},32]
[{"$f":"'Student Profile'!A34","v":""},{"$f":"IF(('Student Profile'!C34)>0,'Student Profile'!C34,\"\")","v":""},34,15,82,34,15,82,34,15,82,34,15,82,34,15,82,34,15,82,34,15,82,172,{"$f":"IFERROR(X35/'Student Profile'!P34,\"\")","v":34.4},15]
[{"$f":"'Student Profile'!A35","v":""},{"$f":"IF(('Student Profile'!C35)>0,'Student Profile'!C35,\"\")","v":""},28,18,77,28,18,77,28,18,77,28,18,77,28,18,77,28,18,77,28,18,77,185,{"$f":"IFERROR(X36/'Student Profile'!P35,\"\")","v":37},5]
[{"$f":"'Student Profile'!A36","v":""},{"$f":"IF(('Student Profile'!C36)>0,'Student Profile'!C36,\"\")","v":""},29,15,74,29,15,74,29,15,74,29,15,74,29,15,74,29,15,74,29,15,74,164,{"$f":"IFERROR(X37/'Student Profile'!P36,\"\")","v":32.799999999999997},28]
[{"$f":"'Student Profile'!A37","v":""},{"$f":"IF(('Student Profile'!C37)>0,'Student Profile'!C37,\"\")","v":""},20,10,50,20,10,50,20,10,50,20,10,50,20,10,50,20,10,50,20,10,50,110,{"$f":"IFERROR(X38/'Student Profile'!P37,\"\")","v":22},42]
[{"$f":"'Student Profile'!A38","v":""},{"$f":"IF(('Student Profile'!C38)>0,'Student Profile'!C38,\"\")","v":""},25,15,67,25,15,67,25,15,67,25,15,67,25,15,67,25,15,67,25,15,67,157,{"$f":"IFERROR(X39/'Student Profile'!P38,\"\")","v":31.4},32]
[{"$f":"'Student Profile'!A39","v":""},{"$f":"IF(('Student Profile'!C39)>0,'Student Profile'!C39,\"\")","v":""},35,20,92,35,20,92,35,20,92,35,20,92,35,20,92,35,20,92,35,20,92,212,{"$f":"IFERROR(X40/'Student Profile'!P39,\"\")","v":42.4},1]
[{"$f":"'Student Profile'!A40","v":""},{"$f":"IF(('Student Profile'!C40)>0,'Student Profile'!C40,\"\")","v":""},25,17,70,25,17,70,25,17,70,25,17,70,25,17,70,25,17,70,25,17,70,172,{"$f":"IFERROR(X41/'Student Profile'!P40,\"\")","v":34.4},15]
[{"$f":"'Student Profile'!A41","v":""},{"$f":"IF(('Student Profile'!C41)>0,'Student Profile'!C41,\"\")","v":""},34,15,82,34,15,82,34,15,82,34,15,82,34,15,82,34,15,82,34,15,82,172,{"$f":"IFERROR(X42/'Student Profile'!P41,\"\")","v":34.4},15]
[{"$f":"'Student Profile'!A42","v":""},{"$f":"IF(('Student Profile'!C42)>0,'Student Profile'!C42,\"\")","v":""},36,15,85,36,15,85,36,15,85,36,15,85,36,15,85,36,15,85,36,15,85,175,{"$f":"IFERROR(X43/'Student Profile'!P42,\"\")","v":35},10]
[{"$f":"'Student Profile'!A43","v":""},{"$f":"IF(('Student Profile'!C43)>0,'Student Profile'!C43,\"\")","v":""},25,15,67,25,15,67,25,15,67,25,15,67,25,15,67,25,15,67,25,15,67,157,{"$f":"IFERROR(X44/'Student Profile'!P43,\"\")","v":31.4},32]
[{"$f":"'Student Profile'!A44","v":""},{"$f":"IF(('Student Profile'!C44)>0,'Student Profile'!C44,\"\")","v":""},34,15,82,34,15,82,34,15,82,34,15,82,34,15,82,34,15,82,34,15,82,172,{"$f":"IFERROR(X45/'Student Profile'!P44,\"\")","v":34.4},15]
[{"$f":"'Student Profile'!A45","v":""},{"$f":"IF(('Student Profile'!C45)>0,'Student Profile'!C45,\"\")","v":""},28,18,77,28,18,77,28,18,77,28,18,77,28,18,77,28,18,77,28,18,77,185,{"$f":"IFERROR(X46/'Student Profile'!P45,\"\")","v":37},5]
[{"$f":"'Student Profile'!A46","v":""},{"$f":"IF(('Student Profile'!C46)>0,'Student Profile'!C46,\"\")","v":""},29,15,74,29,15,74,29,15,74,29,15,74,29,15,74,29,15,74,29,15,74,164,{"$f":"IFERROR(X47/'Student Profile'!P46,\"\")","v":32.799999999999997},28]
[{"$f":"'Student Profile'!A47","v":""},{"$f":"IF(('Student Profile'!C47)>0,'Student Profile'!C47,\"\")","v":""},36,15,85,36,15,85,36,15,85,36,15,85,36,15,85,36,15,85,36,15,85,175,{"$f":"IFERROR(X48/'Student Profile'!P47,\"\")","v":35},10]
[{"$f":"'Student Profile'!A48","v":""},{"$f":"IF(('Student Profile'!C48)>0,'Student Profile'!C48,\"\")","v":""},25,15,67,25,15,67,25,15,67,25,15,67,25,15,67,25,15,67,25,15,67,157,{"$f":"IFERROR(X49/'Student Profile'!P48,\"\")","v":31.4},32]
[{"$f":"'Student Profile'!A49","v":""},{"$f":"IF(('Student Profile'!C49)>0,'Student Profile'!C49,\"\")","v":""},34,15,82,34,15,82,34,15,82,34,15,82,34,15,82,34,15,82,34,15,82,172,{"$f":"IFERROR(X50/'Student Profile'!P49,\"\")","v":34.4},15]
[{"$f":"'Student Profile'!A50","v":""},{"$f":"IF(('Student Profile'!C50)>0,'Student Profile'!C50,\"\")","v":""},28,18,77,28,18,77,28,18,77,28,18,77,28,18,77,28,18,77,28,18,77,185,{"$f":"IFERROR(X51/'Student Profile'!P50,\"\")","v":37},5]
[{"$f":"'Student Profile'!A51","v":""},{"$f":"IF(('Student Profile'!C51)>0,'Student Profile'!C51,\"\")","v":""},"AB",12,20,"AB",12,20,"AB",12,20,"AB",12,20,"AB",12,20,"AB",12,20,"AB",12,20,{"$f":"IF(OR(ISNUMBER(E52),ISNUMBER(H52),ISNUMBER(K52),ISNUMBER(N52),ISNUMBER(Q52),ISNUMBER(T52),ISNUMBER(W52)),SUM(E52,H52,K52,N52,Q52,T52,Q52),\"\")","v":140},{"$f":"IFERROR(X52/'Student Profile'!P51,\"\")","v":28},41]
["Subject Avg.",null,{"$f":"IF(AND(ISNUMBER(Z57),Z57>0),SUM(E8:E52)/C60,\"\")","v":73.666666666666671},null,null,{"$f":"IF(AND(ISNUMBER(Z58),Z58>0),SUM(H8:H52)/F60,\"\")","v":73.666666666666671},null,null,{"$f":"IF(AND(ISNUMBER(Z59),Z59>0),SUM(K8:K52)/I60,\"\")","v":73.666666666666671},null,null,{"$f":"IF(AND(ISNUMBER(Z60),Z60>0),SUM(N8:N52)/L60,\"\")","v":73.666666666666671},null,null,{"$f":"IF(AND(ISNUMBER(Z61),Z61>0),SUM(Q8:Q52)/O60,\"\")","v":73.666666666666671},null,null,{"$f":"IF(AND(ISNUMBER(Z62),Z62>0),SUM(T8:T52)/R60,\"\")","v":73.666666666666671},null,null,{"$f":"IF(AND(ISNUMBER(AO58),AO58>0),SUM(W8:W52)/U60,\"\")","v":""},null,null,"SUBJECTS","Total Student","Present"]
["Pass %age",null,{"$f":"IF(ISNUMBER(C53),(C61/C60)*100,\"0\")","v":97.777777777777771},null,null,{"$f":"IF(ISNUMBER(F53),F61/F60*100,\"0\")","v":97.777777777777771},null,null,{"$f":"IF(ISNUMBER(I53),I61/I60*100,\"0\")","v":97.777777777777771},null,null,{"$f":"IF(ISNUMBER(L53),L61/L60*100,\"0\")","v":97.777777777777771},null,null,{"$f":"IF(ISNUMBER(O53),O61/O60*100,\"0\")","v":97.777777777777771},null,null,{"$f":"IF(ISNUMBER(R53),R61/R60*100,\"0\")","v":97.777777777777771},null,null,{"$f":"IF(ISNUMBER(U53),U61/U60*100,\"0\")","v":"0"}]
["Below 33%",null,{"$f":"COUNTIF(E8:E52,\"<33\")","v":1},null,null,{"$f":"COUNTIF(H8:H52,\"<33\")","v":1},null,null,{"$f":"COUNTIF(K8:K52,\"<33\")","v":1},null,null,{"$f":"COUNTIF(N8:N52,\"<33\")","v":1},null,null,{"$f":"COUNTIF(Q8:Q52,\"<33\")","v":1},null,null,{"$f":"COUNTIF(T8:T52,\"<33\")","v":1},null,null,{"$f":"COUNTIF(V8:V52,\"<33\")","v":45}]
["33% to 50%",null,{"$f":"COUNTIF(E8:E52,\">=33\")-C57-C58-C59","v":0},null,null,{"$f":"COUNTIF(H8:H52,\">=33\")-F57-F58-F59","v":0},null,null,{"$f":"COUNTIF(K8:K52,\">=33\")-I57-I58-I59","v":0},null,null,{"$f":"COUNTIF(N8:N52,\">=33\")-L57-L58-L59","v":0},null,null,{"$f":"COUNTIF(Q8:Q52,\">=33\")-O57-O58-O59","v":0},null,null,{"$f":"COUNTIF(T8:T52,\">=33\")-R57-R58-R59","v":0},null,null,{"$f":"COUNTIF(W8:W52,\">=33\")-U57-U58-U59","v":0}]
["50% to 60%",null,{"$f":"COUNTIF(E8:E52,\">=50\")-C58-C59","v":4},null,null,{"$f":"COUNTIF(H8:H52,\">=50\")-F58-F59","v":4},null,null,{"$f":"COUNTIF(K8:K52,\">=50\")-I58-I59","v":4},null,null,{"$f":"COUNTIF(N8:N52,\">=50\")-L58-L59","v":4},null,null,{"$f":"COUNTIF(Q8:Q52,\">=50\")-O58-O59","v":4},null,null,{"$f":"COUNTIF(T8:T52,\">=50\")-R58-R59","v":4},null,null,{"$f":"COUNTIF(W8:W52,\">=50\")-U58-U59","v":4},null,null,{"$f":"Home!B15","v":"ENGLISH"},{"$f":"C62","v":45},{"$f":"C60","v":45}]
["60% to 75%",null,{"$f":"COUNTIF(E8:E52,\">=60\")-C59","v":17},null,null,{"$f":"COUNTIF(H8:H52,\">=60\")-F59","v":17},null,null,{"$f":"COUNTIF(K8:K52,\">=60\")-I59","v":17},null,null,{"$f":"COUNTIF(N8:N52,\">=60\")-L59","v":17},null,null,{"$f":"COUNTIF(Q8:Q52,\">=60\")-O59","v":17},null,null,{"$f":"COUNTIF(T8:T52,\">=60\")-R59","v":17},null,null,{"$f":"COUNTIF(W8:W52,\">=60\")-U59","v":17},null,null,{"$f":"Home!B16","v":"HINDI"},{"$f":"F62","v":45},{"$f":"F60","v":45}]
["above 75%",null,{"$f":"COUNTIF(E8:E52,\">=75\")","v":23},null,null,{"$f":"COUNTIF(H8:H52,\">=75\")","v":23},null,null,{"$f":"COUNTIF(K8:K52,\">=75\")","v":23},null,null,{"$f":"COUNTIF(N8:N52,\">=75\")","v":23},null,null,{"$f":"COUNTIF(Q8:Q52,\">=75\")","v":23},null,null,{"$f":"COUNTIF(T8:T52,\">=75\")","v":23},null,null,{"$f":"COUNTIF(W8:W52,\">=75\")","v":23},null,null,{"$f":"Home!B17","v":"INFO PRACT"},{"$f":"I62","v":45},{"$f":"I60","v":45}]
["Appeared",null,{"$f":"COUNTIF(E8:E52,\">=0\")","v":45},null,null,{"$f":"COUNTIF(H8:H52,\">=0\")","v":45},null,null,{"$f":"COUNTIF(K8:K52,\">=0\")","v":45},null,null,{"$f":"COUNTIF(N8:N52,\">=0\")","v":45},null,null,{"$f":"COUNTIF(Q8:Q52,\">=0\")","v":45},null,null,{"$f":"COUNTIF(T8:T52,\">=0\")","v":45},null,null,{"$f":"COUNTIF(W8:W52,\">=0\")","v":45},null,null,{"$f":"Home!B18","v":"MATH"},{"$f":"L62","v":45},{"$f":"L60","v":45}]
["Passed",null,{"$f":"COUNTIF(E8:E52,\">=33\")","v":44},null,null,{"$f":"COUNTIF(H8:H52,\">=33\")","v":44},null,null,{"$f":"COUNTIF(K8:K52,\">=33\")","v":44},null,null,{"$f":"COUNTIF(N8:N52,\">=33\")","v":44},null,null,{"$f":"COUNTIF(Q8:Q52,\">=33\")","v":44},null,null,{"$f":"COUNTIF(T8:T52,\">=33\")","v":44},null,null,{"$f":"COUNTIF(W8:W52,\">=33\")","v":44},null,null,{"$f":"Home!B19","v":"CHEM"},{"$f":"O62","v":45},{"$f":"O60","v":45}]
["Total",null,{"$f":"C60+C63","v":45},null,null,{"$f":"F60+F63","v":45},null,null,{"$f":"I60+I63","v":45},null,null,{"$f":"L60+L63","v":45},null,null,{"$f":"O60+O63","v":45},null,null,{"$f":"R60+R63","v":45},null,null,{"$f":"U60+U63","v":45},null,null,{"$f":"Home!B20","v":"PHYSICS"},{"$f":"R62","v":45},{"$f":"R60","v":45}]
["Absent",null,{"$f":"COUNTIF(E8:E52,\"AB\")","v":0},null,null,{"$f":"COUNTIF(H8:H52,\"AB\")","v":0},null,null,{"$f":"COUNTIF(J8:J52,\"AB\")","v":0},null,null,{"$f":"COUNTIF(N8:N52,\"AB\")","v":0},null,null,{"$f":"COUNTIF(Q8:Q52,\"AB\")","v":0},null,null,{"$f":"COUNTIF(T8:T52,\"AB\")","v":0},null,null,{"$f":"COUNTIF(W8:W52,\"AB\")","v":0},null,null,{"$f":"Home!B21","v":"BIO"},{"$f":"U62","v":45},{"$f":"U60","v":45}]

{"sheet":"UT 3 ","index":4,"n_rows":63,"n_cols":26,"rows_kept":63,"cut":false,"hidden":false,"merged":[[62,0,62,1],[62,2,62,4],[62,5,62,7],[62,8,62,10],[62,11,62,13],[62,14,62,16],[62,17,62,19],[62,20,62,22],[60,2,60,4],[60,5,60,7],[60,8,60,10],[60,11,60,13],[60,14,60,16],[60,17,60,19],[60,20,60,22],[61,2,61,4],[61,5,61,7],[61,8,61,10],[61,11,61,13],[61,14,61,16],[61,17,61,19],[61,20,61,22],[58,17,58,19],[58,20,58,22],[59,2,59,4],[59,5,59,7],[59,8,59,10],[59,11,59,13],[59,14,59,16],[59,17,59,19],[59,20,59,22],[56,17,56,19],[56,20,56,22],[57,2,57,4],[57,5,57,7],[57,8,57,10],[57,11,57,13],[57,14,57,16],[57,17,57,19],[57,20,57,22],[52,25,55,25],[53,2,53,4],[53,5,53,7],[53,8,53,10],[53,11,53,13],[53,14,53,16],[53,17,53,19],[53,20,53,22],[54,2,54,4],[54,5,54,7],[54,8,54,10],[54,11,54,13],[54,14,54,16],[54,17,54,19],[54,20,54,22],[55,2,55,4],[55,5,55,7],[55,8,55,10],[55,11,55,13],[55,14,55,16],[55,17,55,19],[55,20,55,22],[52,2,52,4],[52,5,52,7],[52,8,52,10],[52,11,52,13],[52,14,52,16],[52,17,52,19],[52,20,52,22],[52,23,55,23],[52,24,55,24],[3,23,6,23],[3,24,6,24],[3,25,6,25],[4,2,4,3],[4,4,5,4],[4,5,4,6],[4,7,5,7],[4,8,4,9],[4,10,5,10],[4,11,4,12],[4,13,5,13],[4,14,4,15],[4,16,5,16],[4,17,4,18],[4,19,5,19],[4,20,4,21],[4,22,5,22],[3,0,6,0],[3,1,6,1],[3,2,3,4],[3,5,3,7],[3,8,3,10],[3,11,3,13],[3,14,3,16],[3,17,3,19],[3,20,3,22],[0,0,0,11],[0,12,0,25],[1,0,1,25],[2,0,2,5],[2,6,2,14],[2,15,2,25],[52,0,52,1],[53,0,53,1],[54,0,54,1],[56,0,56,1],[55,0,55,1],[56,2,56,4],[56,5,56,7],[56,8,56,10],[56,11,56,13],[56,14,56,16],[58,0,58,1],[57,0,57,1],[58,2,58,4],[58,5,58,7],[58,8,58,10],[58,11,58,13],[58,14,58,16],[61,0,61,1],[60,0,60,1],[59,0,59,1]]}
[{"$f":"Home!C7","v":"JAWAHAR NAVODAYA VIDYALAYA, "},null,null,null,null,null,null,null,null,null,null,null,{"$f":"Home!I7","v":"MOHINDERGARH"}]
["Unit Test-3"]
[{"$f":"Home!C9","v":"XII A"},null,null,null,null,null,{"$f":"Home!C8","v":"2019-20"},null,null,null,null,null,null,null,null,"E"]
["ROLL NO.","STUDENT NAME",{"$f":"Home!B15","v":"ENGLISH"},null,null,{"$f":"Home!B16","v":"HINDI"},null,null,{"$f":"Home!B17","v":"INFO PRACT"},null,null,{"$f":"Home!B18","v":"MATH"},null,null,{"$f":"Home!B19","v":"CHEM"},null,null,{"$f":"Home!B20","v":"PHYSICS"},null,null,{"$f":"Home!B21","v":"BIO"},null,null,"MARKS \nOBT","%AGE","Rank"]
[null,null,"M.M",null,"%age","M.M",null,"%age","M.M",null,"%age","M.M",null,"%age","M.M",null,"%age","M.M",null,"%age","M.M",null,"%age"]
[null,null,"Th.","IA/ Prac.",null,"Th.","IA/ Prac.",null,"Th.","IA/ Prac.",null,"Th.","IA/ Prac.",null,"Th.","IA/ Prac.",null,"Th.","IA/ Prac.",null,"Th.","IA/ Prac."]
[null,null,40,20,100,40,20,100,40,20,100,40,20,100,40,20,100,40,20,100,40,20,100]
[{"$f":"'Student Profile'!A7","v":1},{"$f":"IF(('Student Profile'!C7)>0,'Student Profile'!C7,\"\")","v":"SUNIL KUMAR"},20,10,{"$f":"IF(OR(ISNUMBER(C8),ISNUMBER(D8)),ROUNDUP(SUM(C8:D8)/SUM($C$7,$D$7)*100,0),IF(C8=\"AB\",C8,\"\"))","v":50},20,10,{"$f":"IF(OR(ISNUMBER(F8),ISNUMBER(G8)),ROUNDUP(SUM(F8:G8)/SUM($F$7,$G$7)*100,0),IF(F8=\"AB\",F8,\"\"))","v":50},20,10,{"$f":"IF(OR(ISNUMBER(I8),ISNUMBER(J8)),ROUNDUP(SUM(I8:J8)/SUM($I$7,$J$7)*100,0),IF(I8=\"AB\",I8,\"\"))","v":50},20,10,{"$f":"IF(OR(ISNUMBER(L8),ISNUMBER(M8)),ROUNDUP(SUM(L8:M8)/SUM($L$7,$M$7)*100,0),IF(L8=\"AB\",L8,\"\"))","v":50},20,10,{"$f":"IF(OR(ISNUMBER(O8),ISNUMBER(P8)),ROUNDUP(SUM(O8:P8)/SUM($O$7,$P$7)*100,0),IF(O8=\"AB\",O8,\"\"))","v":50},20,10,{"$f":"IF(OR(ISNUMBER(R8),ISNUMBER(S8)),ROUNDUP(SUM(R8:S8)/SUM($R$7,$S$7)*100,0),IF(R8=\"AB\",R8,\"\"))","v":50},20,10,{"$f":"IF(OR(ISNUMBER(U8),ISNUMBER(V8)),ROUNDUP(SUM(U8:V8)/SUM($U$7,$V$7)*100,0),IF(U8=\"AB\",U8,\"\"))","v":50},{"$f":"IF(OR(ISNUMBER(E8),ISNUMBER(G8),ISNUMBER(J8),ISNUMBER(M8),ISNUMBER(P8),ISNUMBER(S8),ISNUMBER(V8)),SUM(E8,G8,J8,M8,P8,S8,V8),\"\")","v":110},{"$f":"IFERROR(X8/'Student Profile'!P7,\"\")","v":22},{"$f":"IFERROR(RANK(Y8,Y$8:Y$52,0),\"\")","v":42}]
[{"$f":"'Student Profile'!A8","v":""},{"$f":"IF(('Student Profile'!C8)>0,'Student Profile'!C8,\"\")","v":""},25,15,{"$f":"IF(OR(ISNUMBER(C9),ISNUMBER(D9)),ROUNDUP(SUM(C9:D9)/SUM($C$7,$D$7)*100,0),IF(C9=\"AB\",C9,\"\"))","v":67},25,15,{"$f":"IF(OR(ISNUMBER(F9),ISNUMBER(G9)),ROUNDUP(SUM(F9:G9)/SUM($F$7,$G$7)*100,0),IF(F9=\"AB\",F9,\"\"))","v":67},25,15,{"$f":"IF(OR(ISNUMBER(I9),ISNUMBER(J9)),ROUNDUP(SUM(I9:J9)/SUM($I$7,$J$7)*100,0),IF(I9=\"AB\",I9,\"\"))","v":67},25,15,{"$f":"IF(OR(ISNUMBER(L9),ISNUMBER(M9)),ROUNDUP(SUM(L9:M9)/SUM($L$7,$M$7)*100,0),IF(L9=\"AB\",L9,\"\"))","v":67},25,15,{"$f":"IF(OR(ISNUMBER(O9),ISNUMBER(P9)),ROUNDUP(SUM(O9:P9)/SUM($O$7,$P$7)*100,0),IF(O9=\"AB\",O9,\"\"))","v":67},25,15,{"$f":"IF(OR(ISNUMBER(R9),ISNUMBER(S9)),ROUNDUP(SUM(R9:S9)/SUM($R$7,$S$7)*100,0),IF(R9=\"AB\",R9,\"\"))","v":67},25,15,{"$f":"IF(OR(ISNUMBER(U9),ISNUMBER(V9)),ROUNDUP(SUM(U9:V9)/SUM($U$7,$V$7)*100,0),IF(U9=\"AB\",U9,\"\"))","v":67},{"$f":"IF(OR(ISNUMBER(E9),ISNUMBER(G9),ISNUMBER(J9),ISNUMBER(M9),ISNUMBER(P9),ISNUMBER(S9),ISNUMBER(V9)),SUM(E9,G9,J9,M9,P9,S9,V9),\"\")","v":157},{"$f":"IFERROR(X9/'Student Profile'!P8,\"\")","v":31.4},{"$f":"IF(ISNUMBER(Y9),RANK(X9,X$8:X$52,0),\"\")","v":32}]
[{"$f":"'Student Profile'!A9","v":""},{"$f":"IF(('Student Profile'!C9)>0,'Student Profile'!C9,\"\")","v":""},35,20,92,35,20,92,35,20,92,35,20,92,35,20,92,35,20,92,35,20,92,212,{"$f":"IFERROR(X10/'Student Profile'!P9,\"\")","v":42.4},1]
[{"$f":"'Student Profile'!A10","v":""},{"$f":"IF(('Student Profile'!C10)>0,'Student Profile'!C10,\"\")","v":""},25,17,70,25,17,70,25,17,70,25,17,70,25,17,70,25,17,70,25,17,70,172,{"$f":"IFERROR(X11/'Student Profile'!P10,\"\")","v":34.4},15]
[{"$f":"'Student Profile'!A11","v":""},{"$f":"IF(('Student Profile'!C11)>0,'Student Profile'!C11,\"\")","v":""},34,15,82,34,15,82,34,15,82,34,15,82,34,15,82,34,15,82,34,15,82,172,{"$f":"IFERROR(X12/'Student Profile'!P11,\"\")","v":34.4},15]
[{"$f":"'Student Profile'!A12","v":""},{"$f":"IF(('Student Profile'!C12)>0,'Student Profile'!C12,\"\")","v":""},36,15,85,36,15,85,36,15,85,36,15,85,36,15,85,36,15,85,36,15,85,175,{"$f":"IFERROR(X13/'Student Profile'!P12,\"\")","v":35},10]
[{"$f":"'Student Profile'!A13","v":""},{"$f":"IF(('Student Profile'!C13)>0,'Student Profile'!C13,\"\")","v":""},25,15,67,25,15,67,25,15,67,25,15,67,25,15,67,25,15,67,25,15,67,157,{"$f":"IFERROR(X14/'Student Profile'!P13,\"\")","v":31.4},32]
[{"$f":"'Student Profile'!A14","v":""},{"$f":"IF(('Student Profile'!C14)>0,'Student Profile'!C14,\"\")","v":""},34,15,82,34,15,82,34,15,82,34,15,82,34,15,82,34,15,82,34,15,82,172,{"$f":"IFERROR(X15/'Student Profile'!P14,\"\")","v":34.4},15]
[{"$f":"'Student Profile'!A15","v":""},{"$f":"IF(('Student Profile'!C15)>0,'Student Profile'!C15,\"\")","v":""},28,18,77,28,18,77,28,18,77,28,18,77,28,18,77,28,18,77,28,18,77,185,{"$f":"IFERROR(X16/'Student Profile'!P15,\"\")","v":37},5]
[{"$f":"'Student Profile'!A16","v":""},{"$f":"IF(('Student Profile'!C16)>0,'Student Profile'!C16,\"\")","v":""},29,15,74,29,15,74,29,15,74,29,15,74,29,15,74,29,15,74,29,15,74,164,{"$f":"IFERROR(X17/'Student Profile'!P16,\"\")","v":32.799999999999997},28]
[{"$f":"'Student Profile'!A17","v":""},{"$f":"IF(('Student Profile'!C17)>0,'Student Profile'!C17,\"\")","v":""},20,10,50,20,10,50,20,10,50,20,10,50,20,10,50,20,10,50,20,10,50,110,{"$f":"IFERROR(X18/'Student Profile'!P17,\"\")","v":22},42]
[{"$f":"'Student Profile'!A18","v":""},{"$f":"IF(('Student Profile'!C18)>0,'Student Profile'!C18,\"\")","v":""},25,15,67,25,15,67,25,15,67,25,15,67,25,15,67,25,15,67,25,15,67,157,{"$f":"IFERROR(X19/'Student Profile'!P18,\"\")","v":31.4},32]
[{"$f":"'Student Profile'!A19","v":""},{"$f":"IF(('Student Profile'!C19)>0,'Student Profile'!C19,\"\")","v":""},35,20,92,35,20,92,35,20,92,35,20,92,35,20,92,35,20,92,35,20,92,212,{"$f":"IFERROR(X20/'Student Profile'!P19,\"\")","v":42.4},1]
[{"$f":"'Student Profile'!A20","v":""},{"$f":"IF(('Student Profile'!C20)>0,'Student Profile'!C20,\"\")","v":""},25,17,70,25,17,70,25,17,70,25,17,70,25,17,70,25,17,70,25,17,70,172,{"$f":"IFERROR(X21/'Student Profile'!P20,\"\")","v":34.4},15]
[{"$f":"'Student Profile'!A21","v":""},{"$f":"IF(('Student Profile'!C21)>0,'Student Profile'!C21,\"\")","v":""},34,15,82,34,15,82,34,15,82,34,15,82,34,15,82,34,15,82,34,15,82,172,{"$f":"IFERROR(X22/'Student Profile'!P21,\"\")","v":34.4},15]
[{"$f":"'Student Profile'!A22","v":""},{"$f":"IF(('Student Profile'!C22)>0,'Student Profile'!C22,\"\")","v":""},36,15,85,36,15,85,36,15,85,36,15,85,36,15,85,36,15,85,36,15,85,175,{"$f":"IFERROR(X23/'Student Profile'!P22,\"\")","v":35},10]
[{"$f":"'Student Profile'!A23","v":""},{"$f":"IF(('Student Profile'!C23)>0,'Student Profile'!C23,\"\")","v":""},25,15,67,25,15,67,25,15,67,25,15,67,25,15,67,25,15,67,25,15,67,157,{"$f":"IFERROR(X24/'Student Profile'!P23,\"\")","v":31.4},32]
[{"$f":"'Student Profile'!A24","v":""},{"$f":"IF(('Student Profile'!C24)>0,'Student Profile'!C24,\"\")","v":""},34,15,82,34,15,82,34,15,82,34,15,82,34,15,82,34,15,82,34,15,82,172,{"$f":"IFERROR(X25/'Student Profile'!P24,\"\")","v":34.4},15]
[{"$f":"'Student Profile'!A25","v":""},{"$f":"IF(('Student Profile'!C25)>0,'Student Profile'!C25,\"\")","v":""},28,18,77,28,18,77,28,18,77,28,18,77,28,18,77,28,18,77,28,18,77,185,{"$f":"IFERROR(X26/'Student Profile'!P25,\"\")","v":37},5]
[{"$f":"'Student Profile'!A26","v":""},{"$f":"IF(('Student Profile'!C26)>0,'Student Profile'!C26,\"\")","v":""},29,15,74,29,15,74,29,15,74,29,15,74,29,15,74,29,15,74,29,15,74,164,{"$f":"IFERROR(X27/'Student Profile'!P26,\"\")","v":32.799999999999997},28]
[{"$f":"'Student Profile'!A27","v":""},{"$f":"IF(('Student Profile'!C27)>0,'Student Profile'!C27,\"\")","v":""},20,10,50,20,10,50,20,10,50,20,10,50,20,10,50,20,10,50,20,10,50,110,{"$f":"IFERROR(X28/'Student Profile'!P27,\"\")","v":22},42]
[{"$f":"'Student Profile'!A28","v":""},{"$f":"IF(('Student Profile'!C28)>0,'Student Profile'!C28,\"\")","v":""},25,15,67,25,15,67,25,15,67,25,15,67,25,15,67,25,15,67,25,15,67,157,{"$f":"IFERROR(X29/'Student Profile'!P28,\"\")","v":31.4},32]
[{"$f":"'Student Profile'!A29","v":""},{"$f":"IF(('Student Profile'!C29)>0,'Student Profile'!C29,\"\")","v":""},35,20,92,35,20,92,35,20,92,35,20,92,35,20,92,35,20,92,35,20,92,212,{"$f":"IFERROR(X30/'Student Profile'!P29,\"\")","v":42.4},1]
[{"$f":"'Student Profile'!A30","v":""},{"$f":"IF(('Student Profile'!C30)>0,'Student Profile'!C30,\"\")","v":""},25,17,70,25,17,70,25,17,70,25,17,70,25,17,70,25,17,70,25,17,70,172,{"$f":"IFERROR(X31/'Student Profile'!P30,\"\")","v":34.4},15]
[{"$f":"'Student Profile'!A31","v":""},{"$f":"IF(('Student Profile'!C31)>0,'Student Profile'!C31,\"\")","v":""},34,15,82,34,15,82,34,15,82,34,15,82,34,15,82,34,15,82,34,15,82,172,{"$f":"IFERROR(X32/'Student Profile'!P31,\"\")","v":34.4},15]
[{"$f":"'Student Profile'!A32","v":""},{"$f":"IF(('Student Profile'!C32)>0,'Student Profile'!C32,\"\")","v":""},36,15,85,36,15,85,36,15,85,36,15,85,36,15,85,36,15,85,36,15,85,175,{"$f":"IFERROR(X33/'Student Profile'!P32,\"\")","v":35},10]
[{"$f":"'Student Profile'!A33","v":""},{"$f":"IF(('Student Profile'!C33)>0,'Student Profile'!C33,\"\")","v":""},25,15,67,25,15,67,25,15,67,25,15,67,25,15,67,25,15,67,25,15,67,157,{"$f":"IFERROR(X34/'Student Profile'!P33,\"\")","v":31.4},32]
[{"$f":"'Student Profile'!A34","v":""},{"$f":"IF(('Student Profile'!C34)>0,'Student Profile'!C34,\"\")","v":""},34,15,82,34,15,82,34,15,82,34,15,82,34,15,82,34,15,82,34,15,82,172,{"$f":"IFERROR(X35/'Student Profile'!P34,\"\")","v":34.4},15]
[{"$f":"'Student Profile'!A35","v":""},{"$f":"IF(('Student Profile'!C35)>0,'Student Profile'!C35,\"\")","v":""},28,18,77,28,18,77,28,18,77,28,18,77,28,18,77,28,18,77,28,18,77,185,{"$f":"IFERROR(X36/'Student Profile'!P35,\"\")","v":37},5]
[{"$f":"'Student Profile'!A36","v":""},{"$f":"IF(('Student Profile'!C36)>0,'Student Profile'!C36,\"\")","v":""},29,15,74,29,15,74,29,15,74,29,15,74,29,15,74,29,15,74,29,15,74,164,{"$f":"IFERROR(X37/'Student Profile'!P36,\"\")","v":32.799999999999997},28]
[{"$f":"'Student Profile'!A37","v":""},{"$f":"IF(('Student Profile'!C37)>0,'Student Profile'!C37,\"\")","v":""},20,10,50,20,10,50,20,10,50,20,10,50,20,10,50,20,10,50,20,10,50,110,{"$f":"IFERROR(X38/'Student Profile'!P37,\"\")","v":22},42]
[{"$f":"'Student Profile'!A38","v":""},{"$f":"IF(('Student Profile'!C38)>0,'Student Profile'!C38,\"\")","v":""},25,15,67,25,15,67,25,15,67,25,15,67,25,15,67,25,15,67,25,15,67,157,{"$f":"IFERROR(X39/'Student Profile'!P38,\"\")","v":31.4},32]
[{"$f":"'Student Profile'!A39","v":""},{"$f":"IF(('Student Profile'!C39)>0,'Student Profile'!C39,\"\")","v":""},35,20,92,35,20,92,35,20,92,35,20,92,35,20,92,35,20,92,35,20,92,212,{"$f":"IFERROR(X40/'Student Profile'!P39,\"\")","v":42.4},1]
[{"$f":"'Student Profile'!A40","v":""},{"$f":"IF(('Student Profile'!C40)>0,'Student Profile'!C40,\"\")","v":""},25,17,70,25,17,70,25,17,70,25,17,70,25,17,70,25,17,70,25,17,70,172,{"$f":"IFERROR(X41/'Student Profile'!P40,\"\")","v":34.4},15]
[{"$f":"'Student Profile'!A41","v":""},{"$f":"IF(('Student Profile'!C41)>0,'Student Profile'!C41,\"\")","v":""},34,15,82,34,15,82,34,15,82,34,15,82,34,15,82,34,15,82,34,15,82,172,{"$f":"IFERROR(X42/'Student Profile'!P41,\"\")","v":34.4},15]
[{"$f":"'Student Profile'!A42","v":""},{"$f":"IF(('Student Profile'!C42)>0,'Student Profile'!C42,\"\")","v":""},36,15,85,36,15,85,36,15,85,36,15,85,36,15,85,36,15,85,36,15,85,175,{"$f":"IFERROR(X43/'Student Profile'!P42,\"\")","v":35},10]
[{"$f":"'Student Profile'!A43","v":""},{"$f":"IF(('Student Profile'!C43)>0,'Student Profile'!C43,\"\")","v":""},25,15,67,25,15,67,25,15,67,25,15,67,25,15,67,25,15,67,25,15,67,157,{"$f":"IFERROR(X44/'Student Profile'!P43,\"\")","v":31.4},32]
[{"$f":"'Student Profile'!A44","v":""},{"$f":"IF(('Student Profile'!C44)>0,'Student Profile'!C44,\"\")","v":""},34,15,82,34,15,82,34,15,82,34,15,82,34,15,82,34,15,82,34,15,82,172,{"$f":"IFERROR(X45/'Student Profile'!P44,\"\")","v":34.4},15]
[{"$f":"'Student Profile'!A45","v":""},{"$f":"IF(('Student Profile'!C45)>0,'Student Profile'!C45,\"\")","v":""},28,18,77,28,18,77,28,18,77,28,18,77,28,18,77,28,18,77,28,18,77,185,{"$f":"IFERROR(X46/'Student Profile'!P45,\"\")","v":37},5]
[{"$f":"'Student Profile'!A46","v":""},{"$f":"IF(('Student Profile'!C46)>0,'Student Profile'!C46,\"\")","v":""},29,15,74,29,15,74,29,15,74,29,15,74,29,15,74,29,15,74,29,15,74,164,{"$f":"IFERROR(X47/'Student Profile'!P46,\"\")","v":32.799999999999997},28]
[{"$f":"'Student Profile'!A47","v":""},{"$f":"IF(('Student Profile'!C47)>0,'Student Profile'!C47,\"\")","v":""},36,15,85,36,15,85,36,15,85,36,15,85,36,15,85,36,15,85,36,15,85,175,{"$f":"IFERROR(X48/'Student Profile'!P47,\"\")","v":35},10]
[{"$f":"'Student Profile'!A48","v":""},{"$f":"IF(('Student Profile'!C48)>0,'Student Profile'!C48,\"\")","v":""},25,15,67,25,15,67,25,15,67,25,15,67,25,15,67,25,15,67,25,15,67,157,{"$f":"IFERROR(X49/'Student Profile'!P48,\"\")","v":31.4},32]
[{"$f":"'Student Profile'!A49","v":""},{"$f":"IF(('Student Profile'!C49)>0,'Student Profile'!C49,\"\")","v":""},34,15,82,34,15,82,34,15,82,34,15,82,34,15,82,34,15,82,34,15,82,172,{"$f":"IFERROR(X50/'Student Profile'!P49,\"\")","v":34.4},15]
[{"$f":"'Student Profile'!A50","v":""},{"$f":"IF(('Student Profile'!C50)>0,'Student Profile'!C50,\"\")","v":""},28,18,77,28,18,77,28,18,77,28,18,77,28,18,77,28,18,77,28,18,77,185,{"$f":"IFERROR(X51/'Student Profile'!P50,\"\")","v":37},5]
[{"$f":"'Student Profile'!A51","v":""},{"$f":"IF(('Student Profile'!C51)>0,'Student Profile'!C51,\"\")","v":""},"AB",12,20,"AB",12,20,"AB",12,20,"AB",12,20,"AB",12,20,"AB",12,20,"AB",12,20,{"$f":"IF(OR(ISNUMBER(E52),ISNUMBER(H52),ISNUMBER(K52),ISNUMBER(N52),ISNUMBER(Q52),ISNUMBER(T52),ISNUMBER(W52)),SUM(E52,H52,K52,N52,Q52,T52,Q52),\"\")","v":140},{"$f":"IFERROR(X52/'Student Profile'!P51,\"\")","v":28},41]
["Subject Avg.",null,{"$f":"IF(AND(ISNUMBER(Z57),Z57>0),SUM(E8:E52)/C60,\"\")","v":73.666666666666671},null,null,{"$f":"IF(AND(ISNUMBER(Z58),Z58>0),SUM(H8:H52)/F60,\"\")","v":73.666666666666671},null,null,{"$f":"IF(AND(ISNUMBER(Z59),Z59>0),SUM(K8:K52)/I60,\"\")","v":73.666666666666671},null,null,{"$f":"IF(AND(ISNUMBER(Z60),Z60>0),SUM(N8:N52)/L60,\"\")","v":73.666666666666671},null,null,{"$f":"IF(AND(ISNUMBER(Z61),Z61>0),SUM(Q8:Q52)/O60,\"\")","v":73.666666666666671},null,null,{"$f":"IF(AND(ISNUMBER(Z62),Z62>0),SUM(T8:T52)/R60,\"\")","v":73.666666666666671},null,null,{"$f":"IF(AND(ISNUMBER(AO58),AO58>0),SUM(W8:W52)/U60,\"\")","v":""},null,null,"SUBJECTS","Total Student","Present"]
["Pass %age",null,{"$f":"IF(ISNUMBER(C53),(C61/C60)*100,\"0\")","v":97.777777777777771},null,null,{"$f":"IF(ISNUMBER(F53),F61/F60*100,\"0\")","v":97.777777777777771},null,null,{"$f":"IF(ISNUMBER(I53),I61/I60*100,\"0\")","v":97.777777777777771},null,null,{"$f":"IF(ISNUMBER(L53),L61/L60*100,\"0\")","v":97.777777777777771},null,null,{"$f":"IF(ISNUMBER(O53),O61/O60*100,\"0\")","v":97.777777777777771},null,null,{"$f":"IF(ISNUMBER(R53),R61/R60*100,\"0\")","v":97.777777777777771},null,null,{"$f":"IF(ISNUMBER(U53),U61/U60*100,\"0\")","v":"0"}]
["Below 33%",null,{"$f":"COUNTIF(E8:E52,\"<33\")","v":1},null,null,{"$f":"COUNTIF(H8:H52,\"<33\")","v":1},null,null,{"$f":"COUNTIF(K8:K52,\"<33\")","v":1},null,null,{"$f":"COUNTIF(N8:N52,\"<33\")","v":1},null,null,{"$f":"COUNTIF(Q8:Q52,\"<33\")","v":1},null,null,{"$f":"COUNTIF(T8:T52,\"<33\")","v":1},null,null,{"$f":"COUNTIF(V8:V52,\"<33\")","v":45}]
["33% to 50%",null,{"$f":"COUNTIF(E8:E52,\">=33\")-C57-C58-C59","v":0},null,null,{"$f":"COUNTIF(H8:H52,\">=33\")-F57-F58-F59","v":0},null,null,{"$f":"COUNTIF(K8:K52,\">=33\")-I57-I58-I59","v":0},null,null,{"$f":"COUNTIF(N8:N52,\">=33\")-L57-L58-L59","v":0},null,null,{"$f":"COUNTIF(Q8:Q52,\">=33\")-O57-O58-O59","v":0},null,null,{"$f":"COUNTIF(T8:T52,\">=33\")-R57-R58-R59","v":0},null,null,{"$f":"COUNTIF(W8:W52,\">=33\")-U57-U58-U59","v":0}]
["50% to 60%",null,{"$f":"COUNTIF(E8:E52,\">=50\")-C58-C59","v":4},null,null,{"$f":"COUNTIF(H8:H52,\">=50\")-F58-F59","v":4},null,null,{"$f":"COUNTIF(K8:K52,\">=50\")-I58-I59","v":4},null,null,{"$f":"COUNTIF(N8:N52,\">=50\")-L58-L59","v":4},null,null,{"$f":"COUNTIF(Q8:Q52,\">=50\")-O58-O59","v":4},null,null,{"$f":"COUNTIF(T8:T52,\">=50\")-R58-R59","v":4},null,null,{"$f":"COUNTIF(W8:W52,\">=50\")-U58-U59","v":4},null,null,{"$f":"Home!B15","v":"ENGLISH"},{"$f":"C62","v":45},{"$f":"C60","v":45}]
["60% to 75%",null,{"$f":"COUNTIF(E8:E52,\">=60\")-C59","v":17},null,null,{"$f":"COUNTIF(H8:H52,\">=60\")-F59","v":17},null,null,{"$f":"COUNTIF(K8:K52,\">=60\")-I59","v":17},null,null,{"$f":"COUNTIF(N8:N52,\">=60\")-L59","v":17},null,null,{"$f":"COUNTIF(Q8:Q52,\">=60\")-O59","v":17},null,null,{"$f":"COUNTIF(T8:T52,\">=60\")-R59","v":17},null,null,{"$f":"COUNTIF(W8:W52,\">=60\")-U59","v":17},null,null,{"$f":"Home!B16","v":"HINDI"},{"$f":"F62","v":45},{"$f":"F60","v":45}]
["above 75%",null,{"$f":"COUNTIF(E8:E52,\">=75\")","v":23},null,null,{"$f":"COUNTIF(H8:H52,\">=75\")","v":23},null,null,{"$f":"COUNTIF(K8:K52,\">=75\")","v":23},null,null,{"$f":"COUNTIF(N8:N52,\">=75\")","v":23},null,null,{"$f":"COUNTIF(Q8:Q52,\">=75\")","v":23},null,null,{"$f":"COUNTIF(T8:T52,\">=75\")","v":23},null,null,{"$f":"COUNTIF(W8:W52,\">=75\")","v":23},null,null,{"$f":"Home!B17","v":"INFO PRACT"},{"$f":"I62","v":45},{"$f":"I60","v":45}]
["Appeared",null,{"$f":"COUNTIF(E8:E52,\">=0\")","v":45},null,null,{"$f":"COUNTIF(H8:H52,\">=0\")","v":45},null,null,{"$f":"COUNTIF(K8:K52,\">=0\")","v":45},null,null,{"$f":"COUNTIF(N8:N52,\">=0\")","v":45},null,null,{"$f":"COUNTIF(Q8:Q52,\">=0\")","v":45},null,null,{"$f":"COUNTIF(T8:T52,\">=0\")","v":45},null,null,{"$f":"COUNTIF(W8:W52,\">=0\")","v":45},null,null,{"$f":"Home!B18","v":"MATH"},{"$f":"L62","v":45},{"$f":"L60","v":45}]
["Passed",null,{"$f":"COUNTIF(E8:E52,\">=33\")","v":44},null,null,{"$f":"COUNTIF(H8:H52,\">=33\")","v":44},null,null,{"$f":"COUNTIF(K8:K52,\">=33\")","v":44},null,null,{"$f":"COUNTIF(N8:N52,\">=33\")","v":44},null,null,{"$f":"COUNTIF(Q8:Q52,\">=33\")","v":44},null,null,{"$f":"COUNTIF(T8:T52,\">=33\")","v":44},null,null,{"$f":"COUNTIF(W8:W52,\">=33\")","v":44},null,null,{"$f":"Home!B19","v":"CHEM"},{"$f":"O62","v":45},{"$f":"O60","v":45}]
["Total",null,{"$f":"C60+C63","v":45},null,null,{"$f":"F60+F63","v":45},null,null,{"$f":"I60+I63","v":45},null,null,{"$f":"L60+L63","v":45},null,null,{"$f":"O60+O63","v":45},null,null,{"$f":"R60+R63","v":45},null,null,{"$f":"U60+U63","v":45},null,null,{"$f":"Home!B20","v":"PHYSICS"},{"$f":"R62","v":45},{"$f":"R60","v":45}]
["Absent",null,{"$f":"COUNTIF(E8:E52,\"AB\")","v":0},null,null,{"$f":"COUNTIF(H8:H52,\"AB\")","v":0},null,null,{"$f":"COUNTIF(J8:J52,\"AB\")","v":0},null,null,{"$f":"COUNTIF(N8:N52,\"AB\")","v":0},null,null,{"$f":"COUNTIF(Q8:Q52,\"AB\")","v":0},null,null,{"$f":"COUNTIF(T8:T52,\"AB\")","v":0},null,null,{"$f":"COUNTIF(W8:W52,\"AB\")","v":0},null,null,{"$f":"Home!B21","v":"BIO"},{"$f":"U62","v":45},{"$f":"U60","v":45}]

{"sheet":"TT 1","index":5,"n_rows":63,"n_cols":26,"rows_kept":63,"cut":false,"hidden":false,"merged":[[62,0,62,1],[62,2,62,4],[62,5,62,7],[62,8,62,10],[62,11,62,13],[62,14,62,16],[62,17,62,19],[62,20,62,22],[60,2,60,4],[60,5,60,7],[60,8,60,10],[60,11,60,13],[60,14,60,16],[60,17,60,19],[60,20,60,22],[61,2,61,4],[61,5,61,7],[61,8,61,10],[61,11,61,13],[61,14,61,16],[61,17,61,19],[61,20,61,22],[58,17,58,19],[58,20,58,22],[59,2,59,4],[59,5,59,7],[59,8,59,10],[59,11,59,13],[59,14,59,16],[59,17,59,19],[59,20,59,22],[56,17,56,19],[56,20,56,22],[57,2,57,4],[57,5,57,7],[57,8,57,10],[57,11,57,13],[57,14,57,16],[57,17,57,19],[57,20,57,22],[52,25,55,25],[53,2,53,4],[53,5,53,7],[53,8,53,10],[53,11,53,13],[53,14,53,16],[53,17,53,19],[53,20,53,22],[54,2,54,4],[54,5,54,7],[54,8,54,10],[54,11,54,13],[54,14,54,16],[54,17,54,19],[54,20,54,22],[55,2,55,4],[55,5,55,7],[55,8,55,10],[55,11,55,13],[55,14,55,16],[55,17,55,19],[55,20,55,22],[52,2,52,4],[52,5,52,7],[52,8,52,10],[52,11,52,13],[52,14,52,16],[52,17,52,19],[52,20,52,22],[52,23,55,23],[52,24,55,24],[3,23,6,23],[3,24,6,24],[3,25,6,25],[4,2,4,3],[4,4,5,4],[4,5,4,6],[4,7,5,7],[4,8,4,9],[4,10,5,10],[4,11,4,12],[4,13,5,13],[4,14,4,15],[4,16,5,16],[4,17,4,18],[4,19,5,19],[4,20,4,21],[4,22,5,22],[3,0,6,0],[3,1,6,1],[3,2,3,4],[3,5,3,7],[3,8,3,10],[3,11,3,13],[3,14,3,16],[3,17,3,19],[3,20,3,22],[0,0,0,11],[0,12,0,25],[1,0,1,25],[2,0,2,5],[2,6,2,14],[2,15,2,25],[52,0,52,1],[53,0,53,1],[54,0,54,1],[56,0,56,1],[55,0,55,1],[56,2,56,4],[56,5,56,7],[56,8,56,10],[56,11,56,13],[56,14,56,16],[58,0,58,1],[57,0,57,1],[58,2,58,4],[58,5,58,7],[58,8,58,10],[58,11,58,13],[58,14,58,16],[61,0,61,1],[60,0,60,1],[59,0,59,1]]}
[{"$f":"Home!C7","v":"JAWAHAR NAVODAYA VIDYALAYA, "},null,null,null,null,null,null,null,null,null,null,null,{"$f":"Home!I7","v":"MOHINDERGARH"}]
["Term Test-1"]
[{"$f":"Home!C9","v":"XII A"},null,null,null,null,null,{"$f":"Home!C8","v":"2019-20"},null,null,null,null,null,null,null,null,"E"]
["ROLL NO.","STUDENT NAME",{"$f":"Home!B15","v":"ENGLISH"},null,null,{"$f":"Home!B16","v":"HINDI"},null,null,{"$f":"Home!B17","v":"INFO PRACT"},null,null,{"$f":"Home!B18","v":"MATH"},null,null,{"$f":"Home!B19","v":"CHEM"},null,null,{"$f":"Home!B20","v":"PHYSICS"},null,null,{"$f":"Home!B21","v":"BIO"},null,null,"MARKS \nOBT","%AGE","Rank"]
[null,null,"M.M",null,"%age","M.M",null,"%age","M.M",null,"%age","M.M",null,"%age","M.M",null,"%age","M.M",null,"%age","M.M",null,"%age"]
[null,null,"Th.","IA/ Prac.",null,"Th.","IA/ Prac.",null,"Th.","IA/ Prac.",null,"Th.","IA/ Prac.",null,"Th.","IA/ Prac.",null,"Th.","IA/ Prac.",null,"Th.","IA/ Prac."]
[null,null,70,20,100,40,20,100,40,20,100,40,20,100,40,20,100,40,20,100,40,20,100]
[{"$f":"'Student Profile'!A7","v":1},{"$f":"IF(('Student Profile'!C7)>0,'Student Profile'!C7,\"\")","v":"SUNIL KUMAR"},20,10,{"$f":"IF(OR(ISNUMBER(C8),ISNUMBER(D8)),ROUNDUP(SUM(C8:D8)/SUM($C$7,$D$7)*100,0),IF(C8=\"AB\",C8,\"\"))","v":34},20,10,{"$f":"IF(OR(ISNUMBER(F8),ISNUMBER(G8)),ROUNDUP(SUM(F8:G8)/SUM($F$7,$G$7)*100,0),IF(F8=\"AB\",F8,\"\"))","v":50},20,10,{"$f":"IF(OR(ISNUMBER(I8),ISNUMBER(J8)),ROUNDUP(SUM(I8:J8)/SUM($I$7,$J$7)*100,0),IF(I8=\"AB\",I8,\"\"))","v":50},20,10,{"$f":"IF(OR(ISNUMBER(L8),ISNUMBER(M8)),ROUNDUP(SUM(L8:M8)/SUM($L$7,$M$7)*100,0),IF(L8=\"AB\",L8,\"\"))","v":50},20,10,{"$f":"IF(OR(ISNUMBER(O8),ISNUMBER(P8)),ROUNDUP(SUM(O8:P8)/SUM($O$7,$P$7)*100,0),IF(O8=\"AB\",O8,\"\"))","v":50},20,10,{"$f":"IF(OR(ISNUMBER(R8),ISNUMBER(S8)),ROUNDUP(SUM(R8:S8)/SUM($R$7,$S$7)*100,0),IF(R8=\"AB\",R8,\"\"))","v":50},20,10,{"$f":"IF(OR(ISNUMBER(U8),ISNUMBER(V8)),ROUNDUP(SUM(U8:V8)/SUM($U$7,$V$7)*100,0),IF(U8=\"AB\",U8,\"\"))","v":50},{"$f":"IF(OR(ISNUMBER(E8),ISNUMBER(G8),ISNUMBER(J8),ISNUMBER(M8),ISNUMBER(P8),ISNUMBER(S8),ISNUMBER(V8)),SUM(E8,G8,J8,M8,P8,S8,V8),\"\")","v":94},{"$f":"IFERROR(X8/'Student Profile'!P7,\"\")","v":18.8},{"$f":"IFERROR(RANK(Y8,Y$8:Y$52,0),\"\")","v":42}]
[{"$f":"'Student Profile'!A8","v":""},{"$f":"IF(('Student Profile'!C8)>0,'Student Profile'!C8,\"\")","v":""},25,15,{"$f":"IF(OR(ISNUMBER(C9),ISNUMBER(D9)),ROUNDUP(SUM(C9:D9)/SUM($C$7,$D$7)*100,0),IF(C9=\"AB\",C9,\"\"))","v":45},25,15,{"$f":"IF(OR(ISNUMBER(F9),ISNUMBER(G9)),ROUNDUP(SUM(F9:G9)/SUM($F$7,$G$7)*100,0),IF(F9=\"AB\",F9,\"\"))","v":67},25,15,{"$f":"IF(OR(ISNUMBER(I9),ISNUMBER(J9)),ROUNDUP(SUM(I9:J9)/SUM($I$7,$J$7)*100,0),IF(I9=\"AB\",I9,\"\"))","v":67},25,15,{"$f":"IF(OR(ISNUMBER(L9),ISNUMBER(M9)),ROUNDUP(SUM(L9:M9)/SUM($L$7,$M$7)*100,0),IF(L9=\"AB\",L9,\"\"))","v":67},25,15,{"$f":"IF(OR(ISNUMBER(O9),ISNUMBER(P9)),ROUNDUP(SUM(O9:P9)/SUM($O$7,$P$7)*100,0),IF(O9=\"AB\",O9,\"\"))","v":67},25,15,{"$f":"IF(OR(ISNUMBER(R9),ISNUMBER(S9)),ROUNDUP(SUM(R9:S9)/SUM($R$7,$S$7)*100,0),IF(R9=\"AB\",R9,\"\"))","v":67},25,15,{"$f":"IF(OR(ISNUMBER(U9),ISNUMBER(V9)),ROUNDUP(SUM(U9:V9)/SUM($U$7,$V$7)*100,0),IF(U9=\"AB\",U9,\"\"))","v":67},{"$f":"IF(OR(ISNUMBER(E9),ISNUMBER(G9),ISNUMBER(J9),ISNUMBER(M9),ISNUMBER(P9),ISNUMBER(S9),ISNUMBER(V9)),SUM(E9,G9,J9,M9,P9,S9,V9),\"\")","v":135},{"$f":"IFERROR(X9/'Student Profile'!P8,\"\")","v":27},{"$f":"IF(ISNUMBER(Y9),RANK(X9,X$8:X$52,0),\"\")","v":32}]
[{"$f":"'Student Profile'!A9","v":""},{"$f":"IF(('Student Profile'!C9)>0,'Student Profile'!C9,\"\")","v":""},35,20,62,35,20,92,35,20,92,35,20,92,35,20,92,35,20,92,35,20,92,182,{"$f":"IFERROR(X10/'Student Profile'!P9,\"\")","v":36.4},1]
[{"$f":"'Student Profile'!A10","v":""},{"$f":"IF(('Student Profile'!C10)>0,'Student Profile'!C10,\"\")","v":""},25,17,47,25,17,70,25,17,70,25,17,70,25,17,70,25,17,70,25,17,70,149,{"$f":"IFERROR(X11/'Student Profile'!P10,\"\")","v":29.8},10]
[{"$f":"'Student Profile'!A11","v":""},{"$f":"IF(('Student Profile'!C11)>0,'Student Profile'!C11,\"\")","v":""},34,15,55,34,15,82,34,15,82,34,15,82,34,15,82,34,15,82,34,15,82,145,{"$f":"IFERROR(X12/'Student Profile'!P11,\"\")","v":29},19]
[{"$f":"'Student Profile'!A12","v":""},{"$f":"IF(('Student Profile'!C12)>0,'Student Profile'!C12,\"\")","v":""},36,15,57,36,15,85,36,15,85,36,15,85,36,15,85,36,15,85,36,15,85,147,{"$f":"IFERROR(X13/'Student Profile'!P12,\"\")","v":29.4},14]
[{"$f":"'Student Profile'!A13","v":""},{"$f":"IF(('Student Profile'!C13)>0,'Student Profile'!C13,\"\")","v":""},25,15,45,25,15,67,25,15,67,25,15,67,25,15,67,25,15,67,25,15,67,135,{"$f":"IFERROR(X14/'Student Profile'!P13,\"\")","v":27},32]
[{"$f":"'Student Profile'!A14","v":""},{"$f":"IF(('Student Profile'!C14)>0,'Student Profile'!C14,\"\")","v":""},34,15,55,34,15,82,34,15,82,34,15,82,34,15,82,34,15,82,34,15,82,145,{"$f":"IFERROR(X15/'Student Profile'!P14,\"\")","v":29},19]
[{"$f":"'Student Profile'!A15","v":""},{"$f":"IF(('Student Profile'!C15)>0,'Student Profile'!C15,\"\")","v":""},28,18,52,28,18,77,28,18,77,28,18,77,28,18,77,28,18,77,28,18,77,160,{"$f":"IFERROR(X16/'Student Profile'!P15,\"\")","v":32},5]
[{"$f":"'Student Profile'!A16","v":""},{"$f":"IF(('Student Profile'!C16)>0,'Student Profile'!C16,\"\")","v":""},29,15,49,29,15,74,29,15,74,29,15,74,29,15,74,29,15,74,29,15,74,139,{"$f":"IFERROR(X17/'Student Profile'!P16,\"\")","v":27.8},28]
[{"$f":"'Student Profile'!A17","v":""},{"$f":"IF(('Student Profile'!C17)>0,'Student Profile'!C17,\"\")","v":""},20,10,34,20,10,50,20,10,50,20,10,50,20,10,50,20,10,50,20,10,50,94,{"$f":"IFERROR(X18/'Student Profile'!P17,\"\")","v":18.8},42]
[{"$f":"'Student Profile'!A18","v":""},{"$f":"IF(('Student Profile'!C18)>0,'Student Profile'!C18,\"\")","v":""},25,15,45,25,15,67,25,15,67,25,15,67,25,15,67,25,15,67,25,15,67,135,{"$f":"IFERROR(X19/'Student Profile'!P18,\"\")","v":27},32]
[{"$f":"'Student Profile'!A19","v":""},{"$f":"IF(('Student Profile'!C19)>0,'Student Profile'!C19,\"\")","v":""},35,20,62,35,20,92,35,20,92,35,20,92,35,20,92,35,20,92,35,20,92,182,{"$f":"IFERROR(X20/'Student Profile'!P19,\"\")","v":36.4},1]
[{"$f":"'Student Profile'!A20","v":""},{"$f":"IF(('Student Profile'!C20)>0,'Student Profile'!C20,\"\")","v":""},25,17,47,25,17,70,25,17,70,25,17,70,25,17,70,25,17,70,25,17,70,149,{"$f":"IFERROR(X21/'Student Profile'!P20,\"\")","v":29.8},10]
[{"$f":"'Student Profile'!A21","v":""},{"$f":"IF(('Student Profile'!C21)>0,'Student Profile'!C21,\"\")","v":""},34,15,55,34,15,82,34,15,82,34,15,82,34,15,82,34,15,82,34,15,82,145,{"$f":"IFERROR(X22/'Student Profile'!P21,\"\")","v":29},19]
[{"$f":"'Student Profile'!A22","v":""},{"$f":"IF(('Student Profile'!C22)>0,'Student Profile'!C22,\"\")","v":""},36,15,57,36,15,85,36,15,85,36,15,85,36,15,85,36,15,85,36,15,85,147,{"$f":"IFERROR(X23/'Student Profile'!P22,\"\")","v":29.4},14]
[{"$f":"'Student Profile'!A23","v":""},{"$f":"IF(('Student Profile'!C23)>0,'Student Profile'!C23,\"\")","v":""},25,15,45,25,15,67,25,15,67,25,15,67,25,15,67,25,15,67,25,15,67,135,{"$f":"IFERROR(X24/'Student Profile'!P23,\"\")","v":27},32]
[{"$f":"'Student Profile'!A24","v":""},{"$f":"IF(('Student Profile'!C24)>0,'Student Profile'!C24,\"\")","v":""},34,15,55,34,15,82,34,15,82,34,15,82,34,15,82,34,15,82,34,15,82,145,{"$f":"IFERROR(X25/'Student Profile'!P24,\"\")","v":29},19]
[{"$f":"'Student Profile'!A25","v":""},{"$f":"IF(('Student Profile'!C25)>0,'Student Profile'!C25,\"\")","v":""},28,18,52,28,18,77,28,18,77,28,18,77,28,18,77,28,18,77,28,18,77,160,{"$f":"IFERROR(X26/'Student Profile'!P25,\"\")","v":32},5]
[{"$f":"'Student Profile'!A26","v":""},{"$f":"IF(('Student Profile'!C26)>0,'Student Profile'!C26,\"\")","v":""},29,15,49,29,15,74,29,15,74,29,15,74,29,15,74,29,15,74,29,15,74,139,{"$f":"IFERROR(X27/'Student Profile'!P26,\"\")","v":27.8},28]
[{"$f":"'Student Profile'!A27","v":""},{"$f":"IF(('Student Profile'!C27)>0,'Student Profile'!C27,\"\")","v":""},20,10,34,20,10,50,20,10,50,20,10,50,20,10,50,20,10,50,20,10,50,94,{"$f":"IFERROR(X28/'Student Profile'!P27,\"\")","v":18.8},42]
[{"$f":"'Student Profile'!A28","v":""},{"$f":"IF(('Student Profile'!C28)>0,'Student Profile'!C28,\"\")","v":""},25,15,45,25,15,67,25,15,67,25,15,67,25,15,67,25,15,67,25,15,67,135,{"$f":"IFERROR(X29/'Student Profile'!P28,\"\")","v":27},32]
[{"$f":"'Student Profile'!A29","v":""},{"$f":"IF(('Student Profile'!C29)>0,'Student Profile'!C29,\"\")","v":""},35,20,62,35,20,92,35,20,92,35,20,92,35,20,92,35,20,92,35,20,92,182,{"$f":"IFERROR(X30/'Student Profile'!P29,\"\")","v":36.4},1]
[{"$f":"'Student Profile'!A30","v":""},{"$f":"IF(('Student Profile'!C30)>0,'Student Profile'!C30,\"\")","v":""},25,17,47,25,17,70,25,17,70,25,17,70,25,17,70,25,17,70,25,17,70,149,{"$f":"IFERROR(X31/'Student Profile'!P30,\"\")","v":29.8},10]
[{"$f":"'Student Profile'!A31","v":""},{"$f":"IF(('Student Profile'!C31)>0,'Student Profile'!C31,\"\")","v":""},34,15,55,34,15,82,34,15,82,34,15,82,34,15,82,34,15,82,34,15,82,145,{"$f":"IFERROR(X32/'Student Profile'!P31,\"\")","v":29},19]
[{"$f":"'Student Profile'!A32","v":""},{"$f":"IF(('Student Profile'!C32)>0,'Student Profile'!C32,\"\")","v":""},36,15,57,36,15,85,36,15,85,36,15,85,36,15,85,36,15,85,36,15,85,147,{"$f":"IFERROR(X33/'Student Profile'!P32,\"\")","v":29.4},14]
[{"$f":"'Student Profile'!A33","v":""},{"$f":"IF(('Student Profile'!C33)>0,'Student Profile'!C33,\"\")","v":""},25,15,45,25,15,67,25,15,67,25,15,67,25,15,67,25,15,67,25,15,67,135,{"$f":"IFERROR(X34/'Student Profile'!P33,\"\")","v":27},32]
[{"$f":"'Student Profile'!A34","v":""},{"$f":"IF(('Student Profile'!C34)>0,'Student Profile'!C34,\"\")","v":""},34,15,55,34,15,82,34,15,82,34,15,82,34,15,82,34,15,82,34,15,82,145,{"$f":"IFERROR(X35/'Student Profile'!P34,\"\")","v":29},19]
[{"$f":"'Student Profile'!A35","v":""},{"$f":"IF(('Student Profile'!C35)>0,'Student Profile'!C35,\"\")","v":""},28,18,52,28,18,77,28,18,77,28,18,77,28,18,77,28,18,77,28,18,77,160,{"$f":"IFERROR(X36/'Student Profile'!P35,\"\")","v":32},5]
[{"$f":"'Student Profile'!A36","v":""},{"$f":"IF(('Student Profile'!C36)>0,'Student Profile'!C36,\"\")","v":""},29,15,49,29,15,74,29,15,74,29,15,74,29,15,74,29,15,74,29,15,74,139,{"$f":"IFERROR(X37/'Student Profile'!P36,\"\")","v":27.8},28]
[{"$f":"'Student Profile'!A37","v":""},{"$f":"IF(('Student Profile'!C37)>0,'Student Profile'!C37,\"\")","v":""},20,10,34,20,10,50,20,10,50,20,10,50,20,10,50,20,10,50,20,10,50,94,{"$f":"IFERROR(X38/'Student Profile'!P37,\"\")","v":18.8},42]
[{"$f":"'Student Profile'!A38","v":""},{"$f":"IF(('Student Profile'!C38)>0,'Student Profile'!C38,\"\")","v":""},25,15,45,25,15,67,25,15,67,25,15,67,25,15,67,25,15,67,25,15,67,135,{"$f":"IFERROR(X39/'Student Profile'!P38,\"\")","v":27},32]
[{"$f":"'Student Profile'!A39","v":""},{"$f":"IF(('Student Profile'!C39)>0,'Student Profile'!C39,\"\")","v":""},35,20,62,35,20,92,35,20,92,35,20,92,35,20,92,35,20,92,35,20,92,182,{"$f":"IFERROR(X40/'Student Profile'!P39,\"\")","v":36.4},1]
[{"$f":"'Student Profile'!A40","v":""},{"$f":"IF(('Student Profile'!C40)>0,'Student Profile'!C40,\"\")","v":""},25,17,47,25,17,70,25,17,70,25,17,70,25,17,70,25,17,70,25,17,70,149,{"$f":"IFERROR(X41/'Student Profile'!P40,\"\")","v":29.8},10]
[{"$f":"'Student Profile'!A41","v":""},{"$f":"IF(('Student Profile'!C41)>0,'Student Profile'!C41,\"\")","v":""},34,15,55,34,15,82,34,15,82,34,15,82,34,15,82,34,15,82,34,15,82,145,{"$f":"IFERROR(X42/'Student Profile'!P41,\"\")","v":29},19]
[{"$f":"'Student Profile'!A42","v":""},{"$f":"IF(('Student Profile'!C42)>0,'Student Profile'!C42,\"\")","v":""},36,15,57,36,15,85,36,15,85,36,15,85,36,15,85,36,15,85,36,15,85,147,{"$f":"IFERROR(X43/'Student Profile'!P42,\"\")","v":29.4},14]
[{"$f":"'Student Profile'!A43","v":""},{"$f":"IF(('Student Profile'!C43)>0,'Student Profile'!C43,\"\")","v":""},25,15,45,25,15,67,25,15,67,25,15,67,25,15,67,25,15,67,25,15,67,135,{"$f":"IFERROR(X44/'Student Profile'!P43,\"\")","v":27},32]
[{"$f":"'Student Profile'!A44","v":""},{"$f":"IF(('Student Profile'!C44)>0,'Student Profile'!C44,\"\")","v":""},34,15,55,34,15,82,34,15,82,34,15,82,34,15,82,34,15,82,34,15,82,145,{"$f":"IFERROR(X45/'Student Profile'!P44,\"\")","v":29},19]
[{"$f":"'Student Profile'!A45","v":""},{"$f":"IF(('Student Profile'!C45)>0,'Student Profile'!C45,\"\")","v":""},28,18,52,28,18,77,28,18,77,28,18,77,28,18,77,28,18,77,28,18,77,160,{"$f":"IFERROR(X46/'Student Profile'!P45,\"\")","v":32},5]
[{"$f":"'Student Profile'!A46","v":""},{"$f":"IF(('Student Profile'!C46)>0,'Student Profile'!C46,\"\")","v":""},29,15,49,29,15,74,29,15,74,29,15,74,29,15,74,29,15,74,29,15,74,139,{"$f":"IFERROR(X47/'Student Profile'!P46,\"\")","v":27.8},28]
[{"$f":"'Student Profile'!A47","v":""},{"$f":"IF(('Student Profile'!C47)>0,'Student Profile'!C47,\"\")","v":""},36,15,57,36,15,85,36,15,85,36,15,85,36,15,85,36,15,85,36,15,85,147,{"$f":"IFERROR(X48/'Student Profile'!P47,\"\")","v":29.4},14]
[{"$f":"'Student Profile'!A48","v":""},{"$f":"IF(('Student Profile'!C48)>0,'Student Profile'!C48,\"\")","v":""},25,15,45,25,15,67,25,15,67,25,15,67,25,15,67,25,15,67,25,15,67,135,{"$f":"IFERROR(X49/'Student Profile'!P48,\"\")","v":27},32]
[{"$f":"'Student Profile'!A49","v":""},{"$f":"IF(('Student Profile'!C49)>0,'Student Profile'!C49,\"\")","v":""},34,15,55,34,15,82,34,15,82,34,15,82,34,15,82,34,15,82,34,15,82,145,{"$f":"IFERROR(X50/'Student Profile'!P49,\"\")","v":29},19]
[{"$f":"'Student Profile'!A50","v":""},{"$f":"IF(('Student Profile'!C50)>0,'Student Profile'!C50,\"\")","v":""},28,18,52,28,18,77,28,18,77,28,18,77,28,18,77,28,18,77,28,18,77,160,{"$f":"IFERROR(X51/'Student Profile'!P50,\"\")","v":32},5]
[{"$f":"'Student Profile'!A51","v":""},{"$f":"IF(('Student Profile'!C51)>0,'Student Profile'!C51,\"\")","v":""},"AB",12,14,"AB",12,20,"AB",12,20,"AB",12,20,"AB",12,20,"AB",12,20,"AB",12,20,{"$f":"IF(OR(ISNUMBER(E52),ISNUMBER(H52),ISNUMBER(K52),ISNUMBER(N52),ISNUMBER(Q52),ISNUMBER(T52),ISNUMBER(W52)),SUM(E52,H52,K52,N52,Q52,T52,Q52),\"\")","v":134},{"$f":"IFERROR(X52/'Student Profile'!P51,\"\")","v":26.8},41]
["Subject Avg.",null,{"$f":"IF(AND(ISNUMBER(Z57),Z57>0),SUM(E8:E52)/C60,\"\")","v":49.488888888888887},null,null,{"$f":"IF(AND(ISNUMBER(Z58),Z58>0),SUM(H8:H52)/F60,\"\")","v":73.666666666666671},null,null,{"$f":"IF(AND(ISNUMBER(Z59),Z59>0),SUM(K8:K52)/I60,\"\")","v":73.666666666666671},null,null,{"$f":"IF(AND(ISNUMBER(Z60),Z60>0),SUM(N8:N52)/L60,\"\")","v":73.666666666666671},null,null,{"$f":"IF(AND(ISNUMBER(Z61),Z61>0),SUM(Q8:Q52)/O60,\"\")","v":73.666666666666671},null,null,{"$f":"IF(AND(ISNUMBER(Z62),Z62>0),SUM(T8:T52)/R60,\"\")","v":73.666666666666671},null,null,{"$f":"IF(AND(ISNUMBER(AO58),AO58>0),SUM(W8:W52)/U60,\"\")","v":""},null,null,"SUBJECTS","Total Student","Present"]
["Pass %age",null,{"$f":"IF(ISNUMBER(C53),(C61/C60)*100,\"0\")","v":97.777777777777771},null,null,{"$f":"IF(ISNUMBER(F53),F61/F60*100,\"0\")","v":97.777777777777771},null,null,{"$f":"IF(ISNUMBER(I53),I61/I60*100,\"0\")","v":97.777777777777771},null,null,{"$f":"IF(ISNUMBER(L53),L61/L60*100,\"0\")","v":97.777777777777771},null,null,{"$f":"IF(ISNUMBER(O53),O61/O60*100,\"0\")","v":97.777777777777771},null,null,{"$f":"IF(ISNUMBER(R53),R61/R60*100,\"0\")","v":97.777777777777771},null,null,{"$f":"IF(ISNUMBER(U53),U61/U60*100,\"0\")","v":"0"}]
["Below 33%",null,{"$f":"COUNTIF(E8:E52,\"<33\")","v":1},null,null,{"$f":"COUNTIF(H8:H52,\"<33\")","v":1},null,null,{"$f":"COUNTIF(K8:K52,\"<33\")","v":1},null,null,{"$f":"COUNTIF(N8:N52,\"<33\")","v":1},null,null,{"$f":"COUNTIF(Q8:Q52,\"<33\")","v":1},null,null,{"$f":"COUNTIF(T8:T52,\"<33\")","v":1},null,null,{"$f":"COUNTIF(V8:V52,\"<33\")","v":45}]
["33% to 50%",null,{"$f":"COUNTIF(E8:E52,\">=33\")-C57-C58-C59","v":21},null,null,{"$f":"COUNTIF(H8:H52,\">=33\")-F57-F58-F59","v":0},null,null,{"$f":"COUNTIF(K8:K52,\">=33\")-I57-I58-I59","v":0},null,null,{"$f":"COUNTIF(N8:N52,\">=33\")-L57-L58-L59","v":0},null,null,{"$f":"COUNTIF(Q8:Q52,\">=33\")-O57-O58-O59","v":0},null,null,{"$f":"COUNTIF(T8:T52,\">=33\")-R57-R58-R59","v":0},null,null,{"$f":"COUNTIF(W8:W52,\">=33\")-U57-U58-U59","v":0}]
["50% to 60%",null,{"$f":"COUNTIF(E8:E52,\">=50\")-C58-C59","v":19},null,null,{"$f":"COUNTIF(H8:H52,\">=50\")-F58-F59","v":4},null,null,{"$f":"COUNTIF(K8:K52,\">=50\")-I58-I59","v":4},null,null,{"$f":"COUNTIF(N8:N52,\">=50\")-L58-L59","v":4},null,null,{"$f":"COUNTIF(Q8:Q52,\">=50\")-O58-O59","v":4},null,null,{"$f":"COUNTIF(T8:T52,\">=50\")-R58-R59","v":4},null,null,{"$f":"COUNTIF(W8:W52,\">=50\")-U58-U59","v":4},null,null,{"$f":"Home!B15","v":"ENGLISH"},{"$f":"C62","v":45},{"$f":"C60","v":45}]
["60% to 75%",null,{"$f":"COUNTIF(E8:E52,\">=60\")-C59","v":4},null,null,{"$f":"COUNTIF(H8:H52,\">=60\")-F59","v":17},null,null,{"$f":"COUNTIF(K8:K52,\">=60\")-I59","v":17},null,null,{"$f":"COUNTIF(N8:N52,\">=60\")-L59","v":17},null,null,{"$f":"COUNTIF(Q8:Q52,\">=60\")-O59","v":17},null,null,{"$f":"COUNTIF(T8:T52,\">=60\")-R59","v":17},null,null,{"$f":"COUNTIF(W8:W52,\">=60\")-U59","v":17},null,null,{"$f":"Home!B16","v":"HINDI"},{"$f":"F62","v":45},{"$f":"F60","v":45}]
["above 75%",null,{"$f":"COUNTIF(E8:E52,\">=75\")","v":0},null,null,{"$f":"COUNTIF(H8:H52,\">=75\")","v":23},null,null,{"$f":"COUNTIF(K8:K52,\">=75\")","v":23},null,null,{"$f":"COUNTIF(N8:N52,\">=75\")","v":23},null,null,{"$f":"COUNTIF(Q8:Q52,\">=75\")","v":23},null,null,{"$f":"COUNTIF(T8:T52,\">=75\")","v":23},null,null,{"$f":"COUNTIF(W8:W52,\">=75\")","v":23},null,null,{"$f":"Home!B17","v":"INFO PRACT"},{"$f":"I62","v":45},{"$f":"I60","v":45}]
["Appeared",null,{"$f":"COUNTIF(E8:E52,\">=0\")","v":45},null,null,{"$f":"COUNTIF(H8:H52,\">=0\")","v":45},null,null,{"$f":"COUNTIF(K8:K52,\">=0\")","v":45},null,null,{"$f":"COUNTIF(N8:N52,\">=0\")","v":45},null,null,{"$f":"COUNTIF(Q8:Q52,\">=0\")","v":45},null,null,{"$f":"COUNTIF(T8:T52,\">=0\")","v":45},null,null,{"$f":"COUNTIF(W8:W52,\">=0\")","v":45},null,null,{"$f":"Home!B18","v":"MATH"},{"$f":"L62","v":45},{"$f":"L60","v":45}]
["Passed",null,{"$f":"COUNTIF(E8:E52,\">=33\")","v":44},null,null,{"$f":"COUNTIF(H8:H52,\">=33\")","v":44},null,null,{"$f":"COUNTIF(K8:K52,\">=33\")","v":44},null,null,{"$f":"COUNTIF(N8:N52,\">=33\")","v":44},null,null,{"$f":"COUNTIF(Q8:Q52,\">=33\")","v":44},null,null,{"$f":"COUNTIF(T8:T52,\">=33\")","v":44},null,null,{"$f":"COUNTIF(W8:W52,\">=33\")","v":44},null,null,{"$f":"Home!B19","v":"CHEM"},{"$f":"O62","v":45},{"$f":"O60","v":45}]
["Total",null,{"$f":"C60+C63","v":45},null,null,{"$f":"F60+F63","v":45},null,null,{"$f":"I60+I63","v":45},null,null,{"$f":"L60+L63","v":45},null,null,{"$f":"O60+O63","v":45},null,null,{"$f":"R60+R63","v":45},null,null,{"$f":"U60+U63","v":45},null,null,{"$f":"Home!B20","v":"PHYSICS"},{"$f":"R62","v":45},{"$f":"R60","v":45}]
["Absent",null,{"$f":"COUNTIF(E8:E52,\"AB\")","v":0},null,null,{"$f":"COUNTIF(H8:H52,\"AB\")","v":0},null,null,{"$f":"COUNTIF(J8:J52,\"AB\")","v":0},null,null,{"$f":"COUNTIF(N8:N52,\"AB\")","v":0},null,null,{"$f":"COUNTIF(Q8:Q52,\"AB\")","v":0},null,null,{"$f":"COUNTIF(T8:T52,\"AB\")","v":0},null,null,{"$f":"COUNTIF(W8:W52,\"AB\")","v":0},null,null,{"$f":"Home!B21","v":"BIO"},{"$f":"U62","v":45},{"$f":"U60","v":45}]

{"sheet":"UT 4","index":6,"n_rows":63,"n_cols":26,"rows_kept":63,"cut":false,"hidden":false,"merged":[[62,0,62,1],[62,2,62,4],[62,5,62,7],[62,8,62,10],[62,11,62,13],[62,14,62,16],[62,17,62,19],[62,20,62,22],[60,2,60,4],[60,5,60,7],[60,8,60,10],[60,11,60,13],[60,14,60,16],[60,17,60,19],[60,20,60,22],[61,2,61,4],[61,5,61,7],[61,8,61,10],[61,11,61,13],[61,14,61,16],[61,17,61,19],[61,20,61,22],[58,17,58,19],[58,20,58,22],[59,2,59,4],[59,5,59,7],[59,8,59,10],[59,11,59,13],[59,14,59,16],[59,17,59,19],[59,20,59,22],[56,17,56,19],[56,20,56,22],[57,2,57,4],[57,5,57,7],[57,8,57,10],[57,11,57,13],[57,14,57,16],[57,17,57,19],[57,20,57,22],[52,25,55,25],[53,2,53,4],[53,5,53,7],[53,8,53,10],[53,11,53,13],[53,14,53,16],[53,17,53,19],[53,20,53,22],[54,2,54,4],[54,5,54,7],[54,8,54,10],[54,11,54,13],[54,14,54,16],[54,17,54,19],[54,20,54,22],[55,2,55,4],[55,5,55,7],[55,8,55,10],[55,11,55,13],[55,14,55,16],[55,17,55,19],[55,20,55,22],[52,2,52,4],[52,5,52,7],[52,8,52,10],[52,11,52,13],[52,14,52,16],[52,17,52,19],[52,20,52,22],[52,23,55,23],[52,24,55,24],[3,23,6,23],[3,24,6,24],[3,25,6,25],[4,2,4,3],[4,4,5,4],[4,5,4,6],[4,7,5,7],[4,8,4,9],[4,10,5,10],[4,11,4,12],[4,13,5,13],[4,14,4,15],[4,16,5,16],[4,17,4,18],[4,19,5,19],[4,20,4,21],[4,22,5,22],[3,0,6,0],[3,1,6,1],[3,2,3,4],[3,5,3,7],[3,8,3,10],[3,11,3,13],[3,14,3,16],[3,17,3,19],[3,20,3,22],[0,0,0,11],[0,12,0,25],[1,0,1,25],[2,0,2,5],[2,6,2,14],[2,15,2,25],[52,0,52,1],[53,0,53,1],[54,0,54,1],[56,0,56,1],[55,0,55,1],[56,2,56,4],[56,5,56,7],[56,8,56,10],[56,11,56,13],[56,14,56,16],[58,0,58,1],[57,0,57,1],[58,2,58,4],[58,5,58,7],[58,8,58,10],[58,11,58,13],[58,14,58,16],[61,0,61,1],[60,0,60,1],[59,0,59,1]]}
[{"$f":"Home!C7","v":"JAWAHAR NAVODAYA VIDYALAYA, "},null,null,null,null,null,null,null,null,null,null,null,{"$f":"Home!I7","v":"MOHINDERGARH"}]
["Unit Test-4"]
[{"$f":"Home!C9","v":"XII A"},null,null,null,null,null,{"$f":"Home!C8","v":"2019-20"},null,null,null,null,null,null,null,null,"E"]
["ROLL NO.","STUDENT NAME",{"$f":"Home!B15","v":"ENGLISH"},null,null,{"$f":"Home!B16","v":"HINDI"},null,null,{"$f":"Home!B17","v":"INFO PRACT"},null,null,{"$f":"Home!B18","v":"MATH"},null,null,{"$f":"Home!B19","v":"CHEM"},null,null,{"$f":"Home!B20","v":"PHYSICS"},null,null,{"$f":"Home!B21","v":"BIO"},null,null,"MARKS \nOBT","%AGE","Rank"]
[null,null,"M.M",null,"%age","M.M",null,"%age","M.M",null,"%age","M.M",null,"%age","M.M",null,"%age","M.M",null,"%age","M.M",null,"%age"]
[null,null,"Th.","IA/ Prac.",null,"Th.","IA/ Prac.",null,"Th.","IA/ Prac.",null,"Th.","IA/ Prac.",null,"Th.","IA/ Prac.",null,"Th.","IA/ Prac.",null,"Th.","IA/ Prac."]
[null,null,40,20,100,40,20,100,40,20,100,40,20,100,40,20,100,40,20,100,40,20,100]
[{"$f":"'Student Profile'!A7","v":1},{"$f":"IF(('Student Profile'!C7)>0,'Student Profile'!C7,\"\")","v":"SUNIL KUMAR"},20,10,{"$f":"IF(OR(ISNUMBER(C8),ISNUMBER(D8)),ROUNDUP(SUM(C8:D8)/SUM($C$7,$D$7)*100,0),IF(C8=\"AB\",C8,\"\"))","v":50},20,10,{"$f":"IF(OR(ISNUMBER(F8),ISNUMBER(G8)),ROUNDUP(SUM(F8:G8)/SUM($F$7,$G$7)*100,0),IF(F8=\"AB\",F8,\"\"))","v":50},20,10,{"$f":"IF(OR(ISNUMBER(I8),ISNUMBER(J8)),ROUNDUP(SUM(I8:J8)/SUM($I$7,$J$7)*100,0),IF(I8=\"AB\",I8,\"\"))","v":50},20,10,{"$f":"IF(OR(ISNUMBER(L8),ISNUMBER(M8)),ROUNDUP(SUM(L8:M8)/SUM($L$7,$M$7)*100,0),IF(L8=\"AB\",L8,\"\"))","v":50},20,10,{"$f":"IF(OR(ISNUMBER(O8),ISNUMBER(P8)),ROUNDUP(SUM(O8:P8)/SUM($O$7,$P$7)*100,0),IF(O8=\"AB\",O8,\"\"))","v":50},20,10,{"$f":"IF(OR(ISNUMBER(R8),ISNUMBER(S8)),ROUNDUP(SUM(R8:S8)/SUM($R$7,$S$7)*100,0),IF(R8=\"AB\",R8,\"\"))","v":50},20,10,{"$f":"IF(OR(ISNUMBER(U8),ISNUMBER(V8)),ROUNDUP(SUM(U8:V8)/SUM($U$7,$V$7)*100,0),IF(U8=\"AB\",U8,\"\"))","v":50},{"$f":"IF(OR(ISNUMBER(E8),ISNUMBER(G8),ISNUMBER(J8),ISNUMBER(M8),ISNUMBER(P8),ISNUMBER(S8),ISNUMBER(V8)),SUM(E8,G8,J8,M8,P8,S8,V8),\"\")","v":110},{"$f":"IFERROR(X8/'Student Profile'!P7,\"\")","v":22},{"$f":"IFERROR(RANK(Y8,Y$8:Y$52,0),\"\")","v":42}]
[{"$f":"'Student Profile'!A8","v":""},{"$f":"IF(('Student Profile'!C8)>0,'Student Profile'!C8,\"\")","v":""},25,15,{"$f":"IF(OR(ISNUMBER(C9),ISNUMBER(D9)),ROUNDUP(SUM(C9:D9)/SUM($C$7,$D$7)*100,0),IF(C9=\"AB\",C9,\"\"))","v":67},25,15,{"$f":"IF(OR(ISNUMBER(F9),ISNUMBER(G9)),ROUNDUP(SUM(F9:G9)/SUM($F$7,$G$7)*100,0),IF(F9=\"AB\",F9,\"\"))","v":67},25,15,{"$f":"IF(OR(ISNUMBER(I9),ISNUMBER(J9)),ROUNDUP(SUM(I9:J9)/SUM($I$7,$J$7)*100,0),IF(I9=\"AB\",I9,\"\"))","v":67},25,15,{"$f":"IF(OR(ISNUMBER(L9),ISNUMBER(M9)),ROUNDUP(SUM(L9:M9)/SUM($L$7,$M$7)*100,0),IF(L9=\"AB\",L9,\"\"))","v":67},25,15,{"$f":"IF(OR(ISNUMBER(O9),ISNUMBER(P9)),ROUNDUP(SUM(O9:P9)/SUM($O$7,$P$7)*100,0),IF(O9=\"AB\",O9,\"\"))","v":67},25,15,{"$f":"IF(OR(ISNUMBER(R9),ISNUMBER(S9)),ROUNDUP(SUM(R9:S9)/SUM($R$7,$S$7)*100,0),IF(R9=\"AB\",R9,\"\"))","v":67},25,15,{"$f":"IF(OR(ISNUMBER(U9),ISNUMBER(V9)),ROUNDUP(SUM(U9:V9)/SUM($U$7,$V$7)*100,0),IF(U9=\"AB\",U9,\"\"))","v":67},{"$f":"IF(OR(ISNUMBER(E9),ISNUMBER(G9),ISNUMBER(J9),ISNUMBER(M9),ISNUMBER(P9),ISNUMBER(S9),ISNUMBER(V9)),SUM(E9,G9,J9,M9,P9,S9,V9),\"\")","v":157},{"$f":"IFERROR(X9/'Student Profile'!P8,\"\")","v":31.4},{"$f":"IF(ISNUMBER(Y9),RANK(X9,X$8:X$52,0),\"\")","v":32}]
[{"$f":"'Student Profile'!A9","v":""},{"$f":"IF(('Student Profile'!C9)>0,'Student Profile'!C9,\"\")","v":""},35,20,92,35,20,92,35,20,92,35,20,92,35,20,92,35,20,92,35,20,92,212,{"$f":"IFERROR(X10/'Student Profile'!P9,\"\")","v":42.4},1]
[{"$f":"'Student Profile'!A10","v":""},{"$f":"IF(('Student Profile'!C10)>0,'Student Profile'!C10,\"\")","v":""},25,17,70,25,17,70,25,17,70,25,17,70,25,17,70,25,17,70,25,17,70,172,{"$f":"IFERROR(X11/'Student Profile'!P10,\"\")","v":34.4},15]
[{"$f":"'Student Profile'!A11","v":""},{"$f":"IF(('Student Profile'!C11)>0,'Student Profile'!C11,\"\")","v":""},34,15,82,34,15,82,34,15,82,34,15,82,34,15,82,34,15,82,34,15,82,172,{"$f":"IFERROR(X12/'Student Profile'!P11,\"\")","v":34.4},15]
[{"$f":"'Student Profile'!A12","v":""},{"$f":"IF(('Student Profile'!C12)>0,'Student Profile'!C12,\"\")","v":""},36,15,85,36,15,85,36,15,85,36,15,85,36,15,85,36,15,85,36,15,85,175,{"$f":"IFERROR(X13/'Student Profile'!P12,\"\")","v":35},10]
[{"$f":"'Student Profile'!A13","v":""},{"$f":"IF(('Student Profile'!C13)>0,'Student Profile'!C13,\"\")","v":""},25,15,67,25,15,67,25,15,67,25,15,67,25,15,67,25,15,67,25,15,67,157,{"$f":"IFERROR(X14/'Student Profile'!P13,\"\")","v":31.4},32]
[{"$f":"'Student Profile'!A14","v":""},{"$f":"IF(('Student Profile'!C14)>0,'Student Profile'!C14,\"\")","v":""},34,15,82,34,15,82,34,15,82,34,15,82,34,15,82,34,15,82,34,15,82,172,{"$f":"IFERROR(X15/'Student Profile'!P14,\"\")","v":34.4},15]
[{"$f":"'Student Profile'!A15","v":""},{"$f":"IF(('Student Profile'!C15)>0,'Student Profile'!C15,\"\")","v":""},28,18,77,28,18,77,28,18,77,28,18,77,28,18,77,28,18,77,28,18,77,185,{"$f":"IFERROR(X16/'Student Profile'!P15,\"\")","v":37},5]
[{"$f":"'Student Profile'!A16","v":""},{"$f":"IF(('Student Profile'!C16)>0,'Student Profile'!C16,\"\")","v":""},29,15,74,29,15,74,29,15,74,29,15,74,29,15,74,29,15,74,29,15,74,164,{"$f":"IFERROR(X17/'Student Profile'!P16,\"\")","v":32.799999999999997},28]
[{"$f":"'Student Profile'!A17","v":""},{"$f":"IF(('Student Profile'!C17)>0,'Student Profile'!C17,\"\")","v":""},20,10,50,20,10,50,20,10,50,20,10,50,20,10,50,20,10,50,20,10,50,110,{"$f":"IFERROR(X18/'Student Profile'!P17,\"\")","v":22},42]
[{"$f":"'Student Profile'!A18","v":""},{"$f":"IF(('Student Profile'!C18)>0,'Student Profile'!C18,\"\")","v":""},25,15,67,25,15,67,25,15,67,25,15,67,25,15,67,25,15,67,25,15,67,157,{"$f":"IFERROR(X19/'Student Profile'!P18,\"\")","v":31.4},32]
[{"$f":"'Student Profile'!A19","v":""},{"$f":"IF(('Student Profile'!C19)>0,'Student Profile'!C19,\"\")","v":""},35,20,92,35,20,92,35,20,92,35,20,92,35,20,92,35,20,92,35,20,92,212,{"$f":"IFERROR(X20/'Student Profile'!P19,\"\")","v":42.4},1]
[{"$f":"'Student Profile'!A20","v":""},{"$f":"IF(('Student Profile'!C20)>0,'Student Profile'!C20,\"\")","v":""},25,17,70,25,17,70,25,17,70,25,17,70,25,17,70,25,17,70,25,17,70,172,{"$f":"IFERROR(X21/'Student Profile'!P20,\"\")","v":34.4},15]
[{"$f":"'Student Profile'!A21","v":""},{"$f":"IF(('Student Profile'!C21)>0,'Student Profile'!C21,\"\")","v":""},34,15,82,34,15,82,34,15,82,34,15,82,34,15,82,34,15,82,34,15,82,172,{"$f":"IFERROR(X22/'Student Profile'!P21,\"\")","v":34.4},15]
[{"$f":"'Student Profile'!A22","v":""},{"$f":"IF(('Student Profile'!C22)>0,'Student Profile'!C22,\"\")","v":""},36,15,85,36,15,85,36,15,85,36,15,85,36,15,85,36,15,85,36,15,85,175,{"$f":"IFERROR(X23/'Student Profile'!P22,\"\")","v":35},10]
[{"$f":"'Student Profile'!A23","v":""},{"$f":"IF(('Student Profile'!C23)>0,'Student Profile'!C23,\"\")","v":""},25,15,67,25,15,67,25,15,67,25,15,67,25,15,67,25,15,67,25,15,67,157,{"$f":"IFERROR(X24/'Student Profile'!P23,\"\")","v":31.4},32]
[{"$f":"'Student Profile'!A24","v":""},{"$f":"IF(('Student Profile'!C24)>0,'Student Profile'!C24,\"\")","v":""},34,15,82,34,15,82,34,15,82,34,15,82,34,15,82,34,15,82,34,15,82,172,{"$f":"IFERROR(X25/'Student Profile'!P24,\"\")","v":34.4},15]
[{"$f":"'Student Profile'!A25","v":""},{"$f":"IF(('Student Profile'!C25)>0,'Student Profile'!C25,\"\")","v":""},28,18,77,28,18,77,28,18,77,28,18,77,28,18,77,28,18,77,28,18,77,185,{"$f":"IFERROR(X26/'Student Profile'!P25,\"\")","v":37},5]
[{"$f":"'Student Profile'!A26","v":""},{"$f":"IF(('Student Profile'!C26)>0,'Student Profile'!C26,\"\")","v":""},29,15,74,29,15,74,29,15,74,29,15,74,29,15,74,29,15,74,29,15,74,164,{"$f":"IFERROR(X27/'Student Profile'!P26,\"\")","v":32.799999999999997},28]
[{"$f":"'Student Profile'!A27","v":""},{"$f":"IF(('Student Profile'!C27)>0,'Student Profile'!C27,\"\")","v":""},20,10,50,20,10,50,20,10,50,20,10,50,20,10,50,20,10,50,20,10,50,110,{"$f":"IFERROR(X28/'Student Profile'!P27,\"\")","v":22},42]
[{"$f":"'Student Profile'!A28","v":""},{"$f":"IF(('Student Profile'!C28)>0,'Student Profile'!C28,\"\")","v":""},25,15,67,25,15,67,25,15,67,25,15,67,25,15,67,25,15,67,25,15,67,157,{"$f":"IFERROR(X29/'Student Profile'!P28,\"\")","v":31.4},32]
[{"$f":"'Student Profile'!A29","v":""},{"$f":"IF(('Student Profile'!C29)>0,'Student Profile'!C29,\"\")","v":""},35,20,92,35,20,92,35,20,92,35,20,92,35,20,92,35,20,92,35,20,92,212,{"$f":"IFERROR(X30/'Student Profile'!P29,\"\")","v":42.4},1]
[{"$f":"'Student Profile'!A30","v":""},{"$f":"IF(('Student Profile'!C30)>0,'Student Profile'!C30,\"\")","v":""},25,17,70,25,17,70,25,17,70,25,17,70,25,17,70,25,17,70,25,17,70,172,{"$f":"IFERROR(X31/'Student Profile'!P30,\"\")","v":34.4},15]
[{"$f":"'Student Profile'!A31","v":""},{"$f":"IF(('Student Profile'!C31)>0,'Student Profile'!C31,\"\")","v":""},34,15,82,34,15,82,34,15,82,34,15,82,34,15,82,34,15,82,34,15,82,172,{"$f":"IFERROR(X32/'Student Profile'!P31,\"\")","v":34.4},15]
[{"$f":"'Student Profile'!A32","v":""},{"$f":"IF(('Student Profile'!C32)>0,'Student Profile'!C32,\"\")","v":""},36,15,85,36,15,85,36,15,85,36,15,85,36,15,85,36,15,85,36,15,85,175,{"$f":"IFERROR(X33/'Student Profile'!P32,\"\")","v":35},10]
[{"$f":"'Student Profile'!A33","v":""},{"$f":"IF(('Student Profile'!C33)>0,'Student Profile'!C33,\"\")","v":""},25,15,67,25,15,67,25,15,67,25,15,67,25,15,67,25,15,67,25,15,67,157,{"$f":"IFERROR(X34/'Student Profile'!P33,\"\")","v":31.4},32]
[{"$f":"'Student Profile'!A34","v":""},{"$f":"IF(('Student Profile'!C34)>0,'Student Profile'!C34,\"\")","v":""},34,15,82,34,15,82,34,15,82,34,15,82,34,15,82,34,15,82,34,15,82,172,{"$f":"IFERROR(X35/'Student Profile'!P34,\"\")","v":34.4},15]
[{"$f":"'Student Profile'!A35","v":""},{"$f":"IF(('Student Profile'!C35)>0,'Student Profile'!C35,\"\")","v":""},28,18,77,28,18,77,28,18,77,28,18,77,28,18,77,28,18,77,28,18,77,185,{"$f":"IFERROR(X36/'Student Profile'!P35,\"\")","v":37},5]
[{"$f":"'Student Profile'!A36","v":""},{"$f":"IF(('Student Profile'!C36)>0,'Student Profile'!C36,\"\")","v":""},29,15,74,29,15,74,29,15,74,29,15,74,29,15,74,29,15,74,29,15,74,164,{"$f":"IFERROR(X37/'Student Profile'!P36,\"\")","v":32.799999999999997},28]
[{"$f":"'Student Profile'!A37","v":""},{"$f":"IF(('Student Profile'!C37)>0,'Student Profile'!C37,\"\")","v":""},20,10,50,20,10,50,20,10,50,20,10,50,20,10,50,20,10,50,20,10,50,110,{"$f":"IFERROR(X38/'Student Profile'!P37,\"\")","v":22},42]
[{"$f":"'Student Profile'!A38","v":""},{"$f":"IF(('Student Profile'!C38)>0,'Student Profile'!C38,\"\")","v":""},25,15,67,25,15,67,25,15,67,25,15,67,25,15,67,25,15,67,25,15,67,157,{"$f":"IFERROR(X39/'Student Profile'!P38,\"\")","v":31.4},32]
[{"$f":"'Student Profile'!A39","v":""},{"$f":"IF(('Student Profile'!C39)>0,'Student Profile'!C39,\"\")","v":""},35,20,92,35,20,92,35,20,92,35,20,92,35,20,92,35,20,92,35,20,92,212,{"$f":"IFERROR(X40/'Student Profile'!P39,\"\")","v":42.4},1]
[{"$f":"'Student Profile'!A40","v":""},{"$f":"IF(('Student Profile'!C40)>0,'Student Profile'!C40,\"\")","v":""},25,17,70,25,17,70,25,17,70,25,17,70,25,17,70,25,17,70,25,17,70,172,{"$f":"IFERROR(X41/'Student Profile'!P40,\"\")","v":34.4},15]
[{"$f":"'Student Profile'!A41","v":""},{"$f":"IF(('Student Profile'!C41)>0,'Student Profile'!C41,\"\")","v":""},34,15,82,34,15,82,34,15,82,34,15,82,34,15,82,34,15,82,34,15,82,172,{"$f":"IFERROR(X42/'Student Profile'!P41,\"\")","v":34.4},15]
[{"$f":"'Student Profile'!A42","v":""},{"$f":"IF(('Student Profile'!C42)>0,'Student Profile'!C42,\"\")","v":""},36,15,85,36,15,85,36,15,85,36,15,85,36,15,85,36,15,85,36,15,85,175,{"$f":"IFERROR(X43/'Student Profile'!P42,\"\")","v":35},10]
[{"$f":"'Student Profile'!A43","v":""},{"$f":"IF(('Student Profile'!C43)>0,'Student Profile'!C43,\"\")","v":""},25,15,67,25,15,67,25,15,67,25,15,67,25,15,67,25,15,67,25,15,67,157,{"$f":"IFERROR(X44/'Student Profile'!P43,\"\")","v":31.4},32]
[{"$f":"'Student Profile'!A44","v":""},{"$f":"IF(('Student Profile'!C44)>0,'Student Profile'!C44,\"\")","v":""},34,15,82,34,15,82,34,15,82,34,15,82,34,15,82,34,15,82,34,15,82,172,{"$f":"IFERROR(X45/'Student Profile'!P44,\"\")","v":34.4},15]
[{"$f":"'Student Profile'!A45","v":""},{"$f":"IF(('Student Profile'!C45)>0,'Student Profile'!C45,\"\")","v":""},28,18,77,28,18,77,28,18,77,28,18,77,28,18,77,28,18,77,28,18,77,185,{"$f":"IFERROR(X46/'Student Profile'!P45,\"\")","v":37},5]
[{"$f":"'Student Profile'!A46","v":""},{"$f":"IF(('Student Profile'!C46)>0,'Student Profile'!C46,\"\")","v":""},29,15,74,29,15,74,29,15,74,29,15,74,29,15,74,29,15,74,29,15,74,164,{"$f":"IFERROR(X47/'Student Profile'!P46,\"\")","v":32.799999999999997},28]
[{"$f":"'Student Profile'!A47","v":""},{"$f":"IF(('Student Profile'!C47)>0,'Student Profile'!C47,\"\")","v":""},36,15,85,36,15,85,36,15,85,36,15,85,36,15,85,36,15,85,36,15,85,175,{"$f":"IFERROR(X48/'Student Profile'!P47,\"\")","v":35},10]
[{"$f":"'Student Profile'!A48","v":""},{"$f":"IF(('Student Profile'!C48)>0,'Student Profile'!C48,\"\")","v":""},25,15,67,25,15,67,25,15,67,25,15,67,25,15,67,25,15,67,25,15,67,157,{"$f":"IFERROR(X49/'Student Profile'!P48,\"\")","v":31.4},32]
[{"$f":"'Student Profile'!A49","v":""},{"$f":"IF(('Student Profile'!C49)>0,'Student Profile'!C49,\"\")","v":""},34,15,82,34,15,82,34,15,82,34,15,82,34,15,82,34,15,82,34,15,82,172,{"$f":"IFERROR(X50/'Student Profile'!P49,\"\")","v":34.4},15]
[{"$f":"'Student Profile'!A50","v":""},{"$f":"IF(('Student Profile'!C50)>0,'Student Profile'!C50,\"\")","v":""},28,18,77,28,18,77,28,18,77,28,18,77,28,18,77,28,18,77,28,18,77,185,{"$f":"IFERROR(X51/'Student Profile'!P50,\"\")","v":37},5]
[{"$f":"'Student Profile'!A51","v":""},{"$f":"IF(('Student Profile'!C51)>0,'Student Profile'!C51,\"\")","v":""},"AB",12,20,"AB",12,20,"AB",12,20,"AB",12,20,"AB",12,20,"AB",12,20,"AB",12,20,{"$f":"IF(OR(ISNUMBER(E52),ISNUMBER(H52),ISNUMBER(K52),ISNUMBER(N52),ISNUMBER(Q52),ISNUMBER(T52),ISNUMBER(W52)),SUM(E52,H52,K52,N52,Q52,T52,Q52),\"\")","v":140},{"$f":"IFERROR(X52/'Student Profile'!P51,\"\")","v":28},41]
["Subject Avg.",null,{"$f":"IF(AND(ISNUMBER(Z57),Z57>0),SUM(E8:E52)/C60,\"\")","v":73.666666666666671},null,null,{"$f":"IF(AND(ISNUMBER(Z58),Z58>0),SUM(H8:H52)/F60,\"\")","v":73.666666666666671},null,null,{"$f":"IF(AND(ISNUMBER(Z59),Z59>0),SUM(K8:K52)/I60,\"\")","v":73.666666666666671},null,null,{"$f":"IF(AND(ISNUMBER(Z60),Z60>0),SUM(N8:N52)/L60,\"\")","v":73.666666666666671},null,null,{"$f":"IF(AND(ISNUMBER(Z61),Z61>0),SUM(Q8:Q52)/O60,\"\")","v":73.666666666666671},null,null,{"$f":"IF(AND(ISNUMBER(Z62),Z62>0),SUM(T8:T52)/R60,\"\")","v":73.666666666666671},null,null,{"$f":"IF(AND(ISNUMBER(AO58),AO58>0),SUM(W8:W52)/U60,\"\")","v":""},null,null,"SUBJECTS","Total Student","Present"]
["Pass %age",null,{"$f":"IF(ISNUMBER(C53),(C61/C60)*100,\"0\")","v":97.777777777777771},null,null,{"$f":"IF(ISNUMBER(F53),F61/F60*100,\"0\")","v":97.777777777777771},null,null,{"$f":"IF(ISNUMBER(I53),I61/I60*100,\"0\")","v":97.777777777777771},null,null,{"$f":"IF(ISNUMBER(L53),L61/L60*100,\"0\")","v":97.777777777777771},null,null,{"$f":"IF(ISNUMBER(O53),O61/O60*100,\"0\")","v":97.777777777777771},null,null,{"$f":"IF(ISNUMBER(R53),R61/R60*100,\"0\")","v":97.777777777777771},null,null,{"$f":"IF(ISNUMBER(U53),U61/U60*100,\"0\")","v":"0"}]
["Below 33%",null,{"$f":"COUNTIF(E8:E52,\"<33\")","v":1},null,null,{"$f":"COUNTIF(H8:H52,\"<33\")","v":1},null,null,{"$f":"COUNTIF(K8:K52,\"<33\")","v":1},null,null,{"$f":"COUNTIF(N8:N52,\"<33\")","v":1},null,null,{"$f":"COUNTIF(Q8:Q52,\"<33\")","v":1},null,null,{"$f":"COUNTIF(T8:T52,\"<33\")","v":1},null,null,{"$f":"COUNTIF(V8:V52,\"<33\")","v":45}]
["33% to 50%",null,{"$f":"COUNTIF(E8:E52,\">=33\")-C57-C58-C59","v":0},null,null,{"$f":"COUNTIF(H8:H52,\">=33\")-F57-F58-F59","v":0},null,null,{"$f":"COUNTIF(K8:K52,\">=33\")-I57-I58-I59","v":0},null,null,{"$f":"COUNTIF(N8:N52,\">=33\")-L57-L58-L59","v":0},null,null,{"$f":"COUNTIF(Q8:Q52,\">=33\")-O57-O58-O59","v":0},null,null,{"$f":"COUNTIF(T8:T52,\">=33\")-R57-R58-R59","v":0},null,null,{"$f":"COUNTIF(W8:W52,\">=33\")-U57-U58-U59","v":0}]
["50% to 60%",null,{"$f":"COUNTIF(E8:E52,\">=50\")-C58-C59","v":4},null,null,{"$f":"COUNTIF(H8:H52,\">=50\")-F58-F59","v":4},null,null,{"$f":"COUNTIF(K8:K52,\">=50\")-I58-I59","v":4},null,null,{"$f":"COUNTIF(N8:N52,\">=50\")-L58-L59","v":4},null,null,{"$f":"COUNTIF(Q8:Q52,\">=50\")-O58-O59","v":4},null,null,{"$f":"COUNTIF(T8:T52,\">=50\")-R58-R59","v":4},null,null,{"$f":"COUNTIF(W8:W52,\">=50\")-U58-U59","v":4},null,null,{"$f":"Home!B15","v":"ENGLISH"},{"$f":"C62","v":45},{"$f":"C60","v":45}]
["60% to 75%",null,{"$f":"COUNTIF(E8:E52,\">=60\")-C59","v":17},null,null,{"$f":"COUNTIF(H8:H52,\">=60\")-F59","v":17},null,null,{"$f":"COUNTIF(K8:K52,\">=60\")-I59","v":17},null,null,{"$f":"COUNTIF(N8:N52,\">=60\")-L59","v":17},null,null,{"$f":"COUNTIF(Q8:Q52,\">=60\")-O59","v":17},null,null,{"$f":"COUNTIF(T8:T52,\">=60\")-R59","v":17},null,null,{"$f":"COUNTIF(W8:W52,\">=60\")-U59","v":17},null,null,{"$f":"Home!B16","v":"HINDI"},{"$f":"F62","v":45},{"$f":"F60","v":45}]
["above 75%",null,{"$f":"COUNTIF(E8:E52,\">=75\")","v":23},null,null,{"$f":"COUNTIF(H8:H52,\">=75\")","v":23},null,null,{"$f":"COUNTIF(K8:K52,\">=75\")","v":23},null,null,{"$f":"COUNTIF(N8:N52,\">=75\")","v":23},null,null,{"$f":"COUNTIF(Q8:Q52,\">=75\")","v":23},null,null,{"$f":"COUNTIF(T8:T52,\">=75\")","v":23},null,null,{"$f":"COUNTIF(W8:W52,\">=75\")","v":23},null,null,{"$f":"Home!B17","v":"INFO PRACT"},{"$f":"I62","v":45},{"$f":"I60","v":45}]
["Appeared",null,{"$f":"COUNTIF(E8:E52,\">=0\")","v":45},null,null,{"$f":"COUNTIF(H8:H52,\">=0\")","v":45},null,null,{"$f":"COUNTIF(K8:K52,\">=0\")","v":45},null,null,{"$f":"COUNTIF(N8:N52,\">=0\")","v":45},null,null,{"$f":"COUNTIF(Q8:Q52,\">=0\")","v":45},null,null,{"$f":"COUNTIF(T8:T52,\">=0\")","v":45},null,null,{"$f":"COUNTIF(W8:W52,\">=0\")","v":45},null,null,{"$f":"Home!B18","v":"MATH"},{"$f":"L62","v":45},{"$f":"L60","v":45}]
["Passed",null,{"$f":"COUNTIF(E8:E52,\">=33\")","v":44},null,null,{"$f":"COUNTIF(H8:H52,\">=33\")","v":44},null,null,{"$f":"COUNTIF(K8:K52,\">=33\")","v":44},null,null,{"$f":"COUNTIF(N8:N52,\">=33\")","v":44},null,null,{"$f":"COUNTIF(Q8:Q52,\">=33\")","v":44},null,null,{"$f":"COUNTIF(T8:T52,\">=33\")","v":44},null,null,{"$f":"COUNTIF(W8:W52,\">=33\")","v":44},null,null,{"$f":"Home!B19","v":"CHEM"},{"$f":"O62","v":45},{"$f":"O60","v":45}]
["Total",null,{"$f":"C60+C63","v":45},null,null,{"$f":"F60+F63","v":45},null,null,{"$f":"I60+I63","v":45},null,null,{"$f":"L60+L63","v":45},null,null,{"$f":"O60+O63","v":45},null,null,{"$f":"R60+R63","v":45},null,null,{"$f":"U60+U63","v":45},null,null,{"$f":"Home!B20","v":"PHYSICS"},{"$f":"R62","v":45},{"$f":"R60","v":45}]
["Absent",null,{"$f":"COUNTIF(E8:E52,\"AB\")","v":0},null,null,{"$f":"COUNTIF(H8:H52,\"AB\")","v":0},null,null,{"$f":"COUNTIF(J8:J52,\"AB\")","v":0},null,null,{"$f":"COUNTIF(N8:N52,\"AB\")","v":0},null,null,{"$f":"COUNTIF(Q8:Q52,\"AB\")","v":0},null,null,{"$f":"COUNTIF(T8:T52,\"AB\")","v":0},null,null,{"$f":"COUNTIF(W8:W52,\"AB\")","v":0},null,null,{"$f":"Home!B21","v":"BIO"},{"$f":"U62","v":45},{"$f":"U60","v":45}]

{"sheet":"UT 5PB1","index":7,"n_rows":63,"n_cols":26,"rows_kept":63,"cut":false,"hidden":false,"merged":[[62,0,62,1],[62,2,62,4],[62,5,62,7],[62,8,62,10],[62,11,62,13],[62,14,62,16],[62,17,62,19],[62,20,62,22],[60,2,60,4],[60,5,60,7],[60,8,60,10],[60,11,60,13],[60,14,60,16],[60,17,60,19],[60,20,60,22],[61,2,61,4],[61,5,61,7],[61,8,61,10],[61,11,61,13],[61,14,61,16],[61,17,61,19],[61,20,61,22],[58,17,58,19],[58,20,58,22],[59,2,59,4],[59,5,59,7],[59,8,59,10],[59,11,59,13],[59,14,59,16],[59,17,59,19],[59,20,59,22],[56,17,56,19],[56,20,56,22],[57,2,57,4],[57,5,57,7],[57,8,57,10],[57,11,57,13],[57,14,57,16],[57,17,57,19],[57,20,57,22],[52,25,55,25],[53,2,53,4],[53,5,53,7],[53,8,53,10],[53,11,53,13],[53,14,53,16],[53,17,53,19],[53,20,53,22],[54,2,54,4],[54,5,54,7],[54,8,54,10],[54,11,54,13],[54,14,54,16],[54,17,54,19],[54,20,54,22],[55,2,55,4],[55,5,55,7],[55,8,55,10],[55,11,55,13],[55,14,55,16],[55,17,55,19],[55,20,55,22],[52,2,52,4],[52,5,52,7],[52,8,52,10],[52,11,52,13],[52,14,52,16],[52,17,52,19],[52,20,52,22],[52,23,55,23],[52,24,55,24],[3,23,6,23],[3,24,6,24],[3,25,6,25],[4,2,4,3],[4,4,5,4],[4,5,4,6],[4,7,5,7],[4,8,4,9],[4,10,5,10],[4,11,4,12],[4,13,5,13],[4,14,4,15],[4,16,5,16],[4,17,4,18],[4,19,5,19],[4,20,4,21],[4,22,5,22],[3,0,6,0],[3,1,6,1],[3,2,3,4],[3,5,3,7],[3,8,3,10],[3,11,3,13],[3,14,3,16],[3,17,3,19],[3,20,3,22],[0,0,0,11],[0,12,0,25],[1,0,1,25],[2,0,2,5],[2,6,2,14],[2,15,2,25],[52,0,52,1],[53,0,53,1],[54,0,54,1],[56,0,56,1],[55,0,55,1],[56,2,56,4],[56,5,56,7],[56,8,56,10],[56,11,56,13],[56,14,56,16],[58,0,58,1],[57,0,57,1],[58,2,58,4],[58,5,58,7],[58,8,58,10],[58,11,58,13],[58,14,58,16],[61,0,61,1],[60,0,60,1],[59,0,59,1]]}
[{"$f":"Home!C7","v":"JAWAHAR NAVODAYA VIDYALAYA, "},null,null,null,null,null,null,null,null,null,null,null,{"$f":"Home!I7","v":"MOHINDERGARH"}]
["Unit Test-5/ PRE-BOARD 1"]
[{"$f":"Home!C9","v":"XII A"},null,null,null,null,null,{"$f":"Home!C8","v":"2019-20"},null,null,null,null,null,null,null,null,"E"]
["ROLL NO.","STUDENT NAME",{"$f":"Home!B15","v":"ENGLISH"},null,null,{"$f":"Home!B16","v":"HINDI"},null,null,{"$f":"Home!B17","v":"INFO PRACT"},null,null,{"$f":"Home!B18","v":"MATH"},null,null,{"$f":"Home!B19","v":"CHEM"},null,null,{"$f":"Home!B20","v":"PHYSICS"},null,null,{"$f":"Home!B21","v":"BIO"},null,null,"MARKS \nOBT","%AGE","Rank"]
[null,null,"M.M",null,"%age","M.M",null,"%age","M.M",null,"%age","M.M",null,"%age","M.M",null,"%age","M.M",null,"%age","M.M",null,"%age"]
[null,null,"Th.","IA/ Prac.",null,"Th.","IA/ Prac.",null,"Th.","IA/ Prac.",null,"Th.","IA/ Prac.",null,"Th.","IA/ Prac.",null,"Th.","IA/ Prac.",null,"Th.","IA/ Prac."]
[null,null,40,20,100,40,20,100,40,20,100,40,20,100,40,20,100,40,20,100,40,20,100]
[{"$f":"'Student Profile'!A7","v":1},{"$f":"IF(('Student Profile'!C7)>0,'Student Profile'!C7,\"\")","v":"SUNIL KUMAR"},20,10,{"$f":"IF(OR(ISNUMBER(C8),ISNUMBER(D8)),ROUNDUP(SUM(C8:D8)/SUM($C$7,$D$7)*100,0),IF(C8=\"AB\",C8,\"\"))","v":50},20,10,{"$f":"IF(OR(ISNUMBER(F8),ISNUMBER(G8)),ROUNDUP(SUM(F8:G8)/SUM($F$7,$G$7)*100,0),IF(F8=\"AB\",F8,\"\"))","v":50},20,10,{"$f":"IF(OR(ISNUMBER(I8),ISNUMBER(J8)),ROUNDUP(SUM(I8:J8)/SUM($I$7,$J$7)*100,0),IF(I8=\"AB\",I8,\"\"))","v":50},20,10,{"$f":"IF(OR(ISNUMBER(L8),ISNUMBER(M8)),ROUNDUP(SUM(L8:M8)/SUM($L$7,$M$7)*100,0),IF(L8=\"AB\",L8,\"\"))","v":50},20,10,{"$f":"IF(OR(ISNUMBER(O8),ISNUMBER(P8)),ROUNDUP(SUM(O8:P8)/SUM($O$7,$P$7)*100,0),IF(O8=\"AB\",O8,\"\"))","v":50},20,10,{"$f":"IF(OR(ISNUMBER(R8),ISNUMBER(S8)),ROUNDUP(SUM(R8:S8)/SUM($R$7,$S$7)*100,0),IF(R8=\"AB\",R8,\"\"))","v":50},20,10,{"$f":"IF(OR(ISNUMBER(U8),ISNUMBER(V8)),ROUNDUP(SUM(U8:V8)/SUM($U$7,$V$7)*100,0),IF(U8=\"AB\",U8,\"\"))","v":50},{"$f":"IF(OR(ISNUMBER(E8),ISNUMBER(G8),ISNUMBER(J8),ISNUMBER(M8),ISNUMBER(P8),ISNUMBER(S8),ISNUMBER(V8)),SUM(E8,G8,J8,M8,P8,S8,V8),\"\")","v":110},{"$f":"IFERROR(X8/'Student Profile'!P7,\"\")","v":22},{"$f":"IFERROR(RANK(Y8,Y$8:Y$52,0),\"\")","v":42}]
[{"$f":"'Student Profile'!A8","v":""},{"$f":"IF(('Student Profile'!C8)>0,'Student Profile'!C8,\"\")","v":""},25,15,{"$f":"IF(OR(ISNUMBER(C9),ISNUMBER(D9)),ROUNDUP(SUM(C9:D9)/SUM($C$7,$D$7)*100,0),IF(C9=\"AB\",C9,\"\"))","v":67},25,15,{"$f":"IF(OR(ISNUMBER(F9),ISNUMBER(G9)),ROUNDUP(SUM(F9:G9)/SUM($F$7,$G$7)*100,0),IF(F9=\"AB\",F9,\"\"))","v":67},25,15,{"$f":"IF(OR(ISNUMBER(I9),ISNUMBER(J9)),ROUNDUP(SUM(I9:J9)/SUM($I$7,$J$7)*100,0),IF(I9=\"AB\",I9,\"\"))","v":67},25,15,{"$f":"IF(OR(ISNUMBER(L9),ISNUMBER(M9)),ROUNDUP(SUM(L9:M9)/SUM($L$7,$M$7)*100,0),IF(L9=\"AB\",L9,\"\"))","v":67},25,15,{"$f":"IF(OR(ISNUMBER(O9),ISNUMBER(P9)),ROUNDUP(SUM(O9:P9)/SUM($O$7,$P$7)*100,0),IF(O9=\"AB\",O9,\"\"))","v":67},25,15,{"$f":"IF(OR(ISNUMBER(R9),ISNUMBER(S9)),ROUNDUP(SUM(R9:S9)/SUM($R$7,$S$7)*100,0),IF(R9=\"AB\",R9,\"\"))","v":67},25,15,{"$f":"IF(OR(ISNUMBER(U9),ISNUMBER(V9)),ROUNDUP(SUM(U9:V9)/SUM($U$7,$V$7)*100,0),IF(U9=\"AB\",U9,\"\"))","v":67},{"$f":"IF(OR(ISNUMBER(E9),ISNUMBER(G9),ISNUMBER(J9),ISNUMBER(M9),ISNUMBER(P9),ISNUMBER(S9),ISNUMBER(V9)),SUM(E9,G9,J9,M9,P9,S9,V9),\"\")","v":157},{"$f":"IFERROR(X9/'Student Profile'!P8,\"\")","v":31.4},{"$f":"IF(ISNUMBER(Y9),RANK(X9,X$8:X$52,0),\"\")","v":32}]
[{"$f":"'Student Profile'!A9","v":""},{"$f":"IF(('Student Profile'!C9)>0,'Student Profile'!C9,\"\")","v":""},35,20,92,35,20,92,35,20,92,35,20,92,35,20,92,35,20,92,35,20,92,212,{"$f":"IFERROR(X10/'Student Profile'!P9,\"\")","v":42.4},1]
[{"$f":"'Student Profile'!A10","v":""},{"$f":"IF(('Student Profile'!C10)>0,'Student Profile'!C10,\"\")","v":""},25,17,70,25,17,70,25,17,70,25,17,70,25,17,70,25,17,70,25,17,70,172,{"$f":"IFERROR(X11/'Student Profile'!P10,\"\")","v":34.4},15]
[{"$f":"'Student Profile'!A11","v":""},{"$f":"IF(('Student Profile'!C11)>0,'Student Profile'!C11,\"\")","v":""},34,15,82,34,15,82,34,15,82,34,15,82,34,15,82,34,15,82,34,15,82,172,{"$f":"IFERROR(X12/'Student Profile'!P11,\"\")","v":34.4},15]
[{"$f":"'Student Profile'!A12","v":""},{"$f":"IF(('Student Profile'!C12)>0,'Student Profile'!C12,\"\")","v":""},36,15,85,36,15,85,36,15,85,36,15,85,36,15,85,36,15,85,36,15,85,175,{"$f":"IFERROR(X13/'Student Profile'!P12,\"\")","v":35},10]
[{"$f":"'Student Profile'!A13","v":""},{"$f":"IF(('Student Profile'!C13)>0,'Student Profile'!C13,\"\")","v":""},25,15,67,25,15,67,25,15,67,25,15,67,25,15,67,25,15,67,25,15,67,157,{"$f":"IFERROR(X14/'Student Profile'!P13,\"\")","v":31.4},32]
[{"$f":"'Student Profile'!A14","v":""},{"$f":"IF(('Student Profile'!C14)>0,'Student Profile'!C14,\"\")","v":""},34,15,82,34,15,82,34,15,82,34,15,82,34,15,82,34,15,82,34,15,82,172,{"$f":"IFERROR(X15/'Student Profile'!P14,\"\")","v":34.4},15]
[{"$f":"'Student Profile'!A15","v":""},{"$f":"IF(('Student Profile'!C15)>0,'Student Profile'!C15,\"\")","v":""},28,18,77,28,18,77,28,18,77,28,18,77,28,18,77,28,18,77,28,18,77,185,{"$f":"IFERROR(X16/'Student Profile'!P15,\"\")","v":37},5]
[{"$f":"'Student Profile'!A16","v":""},{"$f":"IF(('Student Profile'!C16)>0,'Student Profile'!C16,\"\")","v":""},29,15,74,29,15,74,29,15,74,29,15,74,29,15,74,29,15,74,29,15,74,164,{"$f":"IFERROR(X17/'Student Profile'!P16,\"\")","v":32.799999999999997},28]
[{"$f":"'Student Profile'!A17","v":""},{"$f":"IF(('Student Profile'!C17)>0,'Student Profile'!C17,\"\")","v":""},20,10,50,20,10,50,20,10,50,20,10,50,20,10,50,20,10,50,20,10,50,110,{"$f":"IFERROR(X18/'Student Profile'!P17,\"\")","v":22},42]
[{"$f":"'Student Profile'!A18","v":""},{"$f":"IF(('Student Profile'!C18)>0,'Student Profile'!C18,\"\")","v":""},25,15,67,25,15,67,25,15,67,25,15,67,25,15,67,25,15,67,25,15,67,157,{"$f":"IFERROR(X19/'Student Profile'!P18,\"\")","v":31.4},32]
[{"$f":"'Student Profile'!A19","v":""},{"$f":"IF(('Student Profile'!C19)>0,'Student Profile'!C19,\"\")","v":""},35,20,92,35,20,92,35,20,92,35,20,92,35,20,92,35,20,92,35,20,92,212,{"$f":"IFERROR(X20/'Student Profile'!P19,\"\")","v":42.4},1]
[{"$f":"'Student Profile'!A20","v":""},{"$f":"IF(('Student Profile'!C20)>0,'Student Profile'!C20,\"\")","v":""},25,17,70,25,17,70,25,17,70,25,17,70,25,17,70,25,17,70,25,17,70,172,{"$f":"IFERROR(X21/'Student Profile'!P20,\"\")","v":34.4},15]
[{"$f":"'Student Profile'!A21","v":""},{"$f":"IF(('Student Profile'!C21)>0,'Student Profile'!C21,\"\")","v":""},34,15,82,34,15,82,34,15,82,34,15,82,34,15,82,34,15,82,34,15,82,172,{"$f":"IFERROR(X22/'Student Profile'!P21,\"\")","v":34.4},15]
[{"$f":"'Student Profile'!A22","v":""},{"$f":"IF(('Student Profile'!C22)>0,'Student Profile'!C22,\"\")","v":""},36,15,85,36,15,85,36,15,85,36,15,85,36,15,85,36,15,85,36,15,85,175,{"$f":"IFERROR(X23/'Student Profile'!P22,\"\")","v":35},10]
[{"$f":"'Student Profile'!A23","v":""},{"$f":"IF(('Student Profile'!C23)>0,'Student Profile'!C23,\"\")","v":""},25,15,67,25,15,67,25,15,67,25,15,67,25,15,67,25,15,67,25,15,67,157,{"$f":"IFERROR(X24/'Student Profile'!P23,\"\")","v":31.4},32]
[{"$f":"'Student Profile'!A24","v":""},{"$f":"IF(('Student Profile'!C24)>0,'Student Profile'!C24,\"\")","v":""},34,15,82,34,15,82,34,15,82,34,15,82,34,15,82,34,15,82,34,15,82,172,{"$f":"IFERROR(X25/'Student Profile'!P24,\"\")","v":34.4},15]
[{"$f":"'Student Profile'!A25","v":""},{"$f":"IF(('Student Profile'!C25)>0,'Student Profile'!C25,\"\")","v":""},28,18,77,28,18,77,28,18,77,28,18,77,28,18,77,28,18,77,28,18,77,185,{"$f":"IFERROR(X26/'Student Profile'!P25,\"\")","v":37},5]
[{"$f":"'Student Profile'!A26","v":""},{"$f":"IF(('Student Profile'!C26)>0,'Student Profile'!C26,\"\")","v":""},29,15,74,29,15,74,29,15,74,29,15,74,29,15,74,29,15,74,29,15,74,164,{"$f":"IFERROR(X27/'Student Profile'!P26,\"\")","v":32.799999999999997},28]
[{"$f":"'Student Profile'!A27","v":""},{"$f":"IF(('Student Profile'!C27)>0,'Student Profile'!C27,\"\")","v":""},20,10,50,20,10,50,20,10,50,20,10,50,20,10,50,20,10,50,20,10,50,110,{"$f":"IFERROR(X28/'Student Profile'!P27,\"\")","v":22},42]
[{"$f":"'Student Profile'!A28","v":""},{"$f":"IF(('Student Profile'!C28)>0,'Student Profile'!C28,\"\")","v":""},25,15,67,25,15,67,25,15,67,25,15,67,25,15,67,25,15,67,25,15,67,157,{"$f":"IFERROR(X29/'Student Profile'!P28,\"\")","v":31.4},32]
[{"$f":"'Student Profile'!A29","v":""},{"$f":"IF(('Student Profile'!C29)>0,'Student Profile'!C29,\"\")","v":""},35,20,92,35,20,92,35,20,92,35,20,92,35,20,92,35,20,92,35,20,92,212,{"$f":"IFERROR(X30/'Student Profile'!P29,\"\")","v":42.4},1]
[{"$f":"'Student Profile'!A30","v":""},{"$f":"IF(('Student Profile'!C30)>0,'Student Profile'!C30,\"\")","v":""},25,17,70,25,17,70,25,17,70,25,17,70,25,17,70,25,17,70,25,17,70,172,{"$f":"IFERROR(X31/'Student Profile'!P30,\"\")","v":34.4},15]
[{"$f":"'Student Profile'!A31","v":""},{"$f":"IF(('Student Profile'!C31)>0,'Student Profile'!C31,\"\")","v":""},34,15,82,34,15,82,34,15,82,34,15,82,34,15,82,34,15,82,34,15,82,172,{"$f":"IFERROR(X32/'Student Profile'!P31,\"\")","v":34.4},15]
[{"$f":"'Student Profile'!A32","v":""},{"$f":"IF(('Student Profile'!C32)>0,'Student Profile'!C32,\"\")","v":""},36,15,85,36,15,85,36,15,85,36,15,85,36,15,85,36,15,85,36,15,85,175,{"$f":"IFERROR(X33/'Student Profile'!P32,\"\")","v":35},10]
[{"$f":"'Student Profile'!A33","v":""},{"$f":"IF(('Student Profile'!C33)>0,'Student Profile'!C33,\"\")","v":""},25,15,67,25,15,67,25,15,67,25,15,67,25,15,67,25,15,67,25,15,67,157,{"$f":"IFERROR(X34/'Student Profile'!P33,\"\")","v":31.4},32]
[{"$f":"'Student Profile'!A34","v":""},{"$f":"IF(('Student Profile'!C34)>0,'Student Profile'!C34,\"\")","v":""},34,15,82,34,15,82,34,15,82,34,15,82,34,15,82,34,15,82,34,15,82,172,{"$f":"IFERROR(X35/'Student Profile'!P34,\"\")","v":34.4},15]
[{"$f":"'Student Profile'!A35","v":""},{"$f":"IF(('Student Profile'!C35)>0,'Student Profile'!C35,\"\")","v":""},28,18,77,28,18,77,28,18,77,28,18,77,28,18,77,28,18,77,28,18,77,185,{"$f":"IFERROR(X36/'Student Profile'!P35,\"\")","v":37},5]
[{"$f":"'Student Profile'!A36","v":""},{"$f":"IF(('Student Profile'!C36)>0,'Student Profile'!C36,\"\")","v":""},29,15,74,29,15,74,29,15,74,29,15,74,29,15,74,29,15,74,29,15,74,164,{"$f":"IFERROR(X37/'Student Profile'!P36,\"\")","v":32.799999999999997},28]
[{"$f":"'Student Profile'!A37","v":""},{"$f":"IF(('Student Profile'!C37)>0,'Student Profile'!C37,\"\")","v":""},20,10,50,20,10,50,20,10,50,20,10,50,20,10,50,20,10,50,20,10,50,110,{"$f":"IFERROR(X38/'Student Profile'!P37,\"\")","v":22},42]
[{"$f":"'Student Profile'!A38","v":""},{"$f":"IF(('Student Profile'!C38)>0,'Student Profile'!C38,\"\")","v":""},25,15,67,25,15,67,25,15,67,25,15,67,25,15,67,25,15,67,25,15,67,157,{"$f":"IFERROR(X39/'Student Profile'!P38,\"\")","v":31.4},32]
[{"$f":"'Student Profile'!A39","v":""},{"$f":"IF(('Student Profile'!C39)>0,'Student Profile'!C39,\"\")","v":""},35,20,92,35,20,92,35,20,92,35,20,92,35,20,92,35,20,92,35,20,92,212,{"$f":"IFERROR(X40/'Student Profile'!P39,\"\")","v":42.4},1]
[{"$f":"'Student Profile'!A40","v":""},{"$f":"IF(('Student Profile'!C40)>0,'Student Profile'!C40,\"\")","v":""},25,17,70,25,17,70,25,17,70,25,17,70,25,17,70,25,17,70,25,17,70,172,{"$f":"IFERROR(X41/'Student Profile'!P40,\"\")","v":34.4},15]
[{"$f":"'Student Profile'!A41","v":""},{"$f":"IF(('Student Profile'!C41)>0,'Student Profile'!C41,\"\")","v":""},34,15,82,34,15,82,34,15,82,34,15,82,34,15,82,34,15,82,34,15,82,172,{"$f":"IFERROR(X42/'Student Profile'!P41,\"\")","v":34.4},15]
[{"$f":"'Student Profile'!A42","v":""},{"$f":"IF(('Student Profile'!C42)>0,'Student Profile'!C42,\"\")","v":""},36,15,85,36,15,85,36,15,85,36,15,85,36,15,85,36,15,85,36,15,85,175,{"$f":"IFERROR(X43/'Student Profile'!P42,\"\")","v":35},10]
[{"$f":"'Student Profile'!A43","v":""},{"$f":"IF(('Student Profile'!C43)>0,'Student Profile'!C43,\"\")","v":""},25,15,67,25,15,67,25,15,67,25,15,67,25,15,67,25,15,67,25,15,67,157,{"$f":"IFERROR(X44/'Student Profile'!P43,\"\")","v":31.4},32]
[{"$f":"'Student Profile'!A44","v":""},{"$f":"IF(('Student Profile'!C44)>0,'Student Profile'!C44,\"\")","v":""},34,15,82,34,15,82,34,15,82,34,15,82,34,15,82,34,15,82,34,15,82,172,{"$f":"IFERROR(X45/'Student Profile'!P44,\"\")","v":34.4},15]
[{"$f":"'Student Profile'!A45","v":""},{"$f":"IF(('Student Profile'!C45)>0,'Student Profile'!C45,\"\")","v":""},28,18,77,28,18,77,28,18,77,28,18,77,28,18,77,28,18,77,28,18,77,185,{"$f":"IFERROR(X46/'Student Profile'!P45,\"\")","v":37},5]
[{"$f":"'Student Profile'!A46","v":""},{"$f":"IF(('Student Profile'!C46)>0,'Student Profile'!C46,\"\")","v":""},29,15,74,29,15,74,29,15,74,29,15,74,29,15,74,29,15,74,29,15,74,164,{"$f":"IFERROR(X47/'Student Profile'!P46,\"\")","v":32.799999999999997},28]
[{"$f":"'Student Profile'!A47","v":""},{"$f":"IF(('Student Profile'!C47)>0,'Student Profile'!C47,\"\")","v":""},36,15,85,36,15,85,36,15,85,36,15,85,36,15,85,36,15,85,36,15,85,175,{"$f":"IFERROR(X48/'Student Profile'!P47,\"\")","v":35},10]
[{"$f":"'Student Profile'!A48","v":""},{"$f":"IF(('Student Profile'!C48)>0,'Student Profile'!C48,\"\")","v":""},25,15,67,25,15,67,25,15,67,25,15,67,25,15,67,25,15,67,25,15,67,157,{"$f":"IFERROR(X49/'Student Profile'!P48,\"\")","v":31.4},32]
[{"$f":"'Student Profile'!A49","v":""},{"$f":"IF(('Student Profile'!C49)>0,'Student Profile'!C49,\"\")","v":""},34,15,82,34,15,82,34,15,82,34,15,82,34,15,82,34,15,82,34,15,82,172,{"$f":"IFERROR(X50/'Student Profile'!P49,\"\")","v":34.4},15]
[{"$f":"'Student Profile'!A50","v":""},{"$f":"IF(('Student Profile'!C50)>0,'Student Profile'!C50,\"\")","v":""},28,18,77,28,18,77,28,18,77,28,18,77,28,18,77,28,18,77,28,18,77,185,{"$f":"IFERROR(X51/'Student Profile'!P50,\"\")","v":37},5]
[{"$f":"'Student Profile'!A51","v":""},{"$f":"IF(('Student Profile'!C51)>0,'Student Profile'!C51,\"\")","v":""},"AB",12,20,"AB",12,20,"AB",12,20,"AB",12,20,"AB",12,20,"AB",12,20,"AB",12,20,{"$f":"IF(OR(ISNUMBER(E52),ISNUMBER(H52),ISNUMBER(K52),ISNUMBER(N52),ISNUMBER(Q52),ISNUMBER(T52),ISNUMBER(W52)),SUM(E52,H52,K52,N52,Q52,T52,Q52),\"\")","v":140},{"$f":"IFERROR(X52/'Student Profile'!P51,\"\")","v":28},41]
["Subject Avg.",null,{"$f":"IF(AND(ISNUMBER(Z57),Z57>0),SUM(E8:E52)/C60,\"\")","v":73.666666666666671},null,null,{"$f":"IF(AND(ISNUMBER(Z58),Z58>0),SUM(H8:H52)/F60,\"\")","v":73.666666666666671},null,null,{"$f":"IF(AND(ISNUMBER(Z59),Z59>0),SUM(K8:K52)/I60,\"\")","v":73.666666666666671},null,null,{"$f":"IF(AND(ISNUMBER(Z60),Z60>0),SUM(N8:N52)/L60,\"\")","v":73.666666666666671},null,null,{"$f":"IF(AND(ISNUMBER(Z61),Z61>0),SUM(Q8:Q52)/O60,\"\")","v":73.666666666666671},null,null,{"$f":"IF(AND(ISNUMBER(Z62),Z62>0),SUM(T8:T52)/R60,\"\")","v":73.666666666666671},null,null,{"$f":"IF(AND(ISNUMBER(AO58),AO58>0),SUM(W8:W52)/U60,\"\")","v":""},null,null,"SUBJECTS","Total Student","Present"]
["Pass %age",null,{"$f":"IF(ISNUMBER(C53),(C61/C60)*100,\"0\")","v":97.777777777777771},null,null,{"$f":"IF(ISNUMBER(F53),F61/F60*100,\"0\")","v":97.777777777777771},null,null,{"$f":"IF(ISNUMBER(I53),I61/I60*100,\"0\")","v":97.777777777777771},null,null,{"$f":"IF(ISNUMBER(L53),L61/L60*100,\"0\")","v":97.777777777777771},null,null,{"$f":"IF(ISNUMBER(O53),O61/O60*100,\"0\")","v":97.777777777777771},null,null,{"$f":"IF(ISNUMBER(R53),R61/R60*100,\"0\")","v":97.777777777777771},null,null,{"$f":"IF(ISNUMBER(U53),U61/U60*100,\"0\")","v":"0"}]
["Below 33%",null,{"$f":"COUNTIF(E8:E52,\"<33\")","v":1},null,null,{"$f":"COUNTIF(H8:H52,\"<33\")","v":1},null,null,{"$f":"COUNTIF(K8:K52,\"<33\")","v":1},null,null,{"$f":"COUNTIF(N8:N52,\"<33\")","v":1},null,null,{"$f":"COUNTIF(Q8:Q52,\"<33\")","v":1},null,null,{"$f":"COUNTIF(T8:T52,\"<33\")","v":1},null,null,{"$f":"COUNTIF(V8:V52,\"<33\")","v":45}]
["33% to 50%",null,{"$f":"COUNTIF(E8:E52,\">=33\")-C57-C58-C59","v":0},null,null,{"$f":"COUNTIF(H8:H52,\">=33\")-F57-F58-F59","v":0},null,null,{"$f":"COUNTIF(K8:K52,\">=33\")-I57-I58-I59","v":0},null,null,{"$f":"COUNTIF(N8:N52,\">=33\")-L57-L58-L59","v":0},null,null,{"$f":"COUNTIF(Q8:Q52,\">=33\")-O57-O58-O59","v":0},null,null,{"$f":"COUNTIF(T8:T52,\">=33\")-R57-R58-R59","v":0},null,null,{"$f":"COUNTIF(W8:W52,\">=33\")-U57-U58-U59","v":0}]
["50% to 60%",null,{"$f":"COUNTIF(E8:E52,\">=50\")-C58-C59","v":4},null,null,{"$f":"COUNTIF(H8:H52,\">=50\")-F58-F59","v":4},null,null,{"$f":"COUNTIF(K8:K52,\">=50\")-I58-I59","v":4},null,null,{"$f":"COUNTIF(N8:N52,\">=50\")-L58-L59","v":4},null,null,{"$f":"COUNTIF(Q8:Q52,\">=50\")-O58-O59","v":4},null,null,{"$f":"COUNTIF(T8:T52,\">=50\")-R58-R59","v":4},null,null,{"$f":"COUNTIF(W8:W52,\">=50\")-U58-U59","v":4},null,null,{"$f":"Home!B15","v":"ENGLISH"},{"$f":"C62","v":45},{"$f":"C60","v":45}]
["60% to 75%",null,{"$f":"COUNTIF(E8:E52,\">=60\")-C59","v":17},null,null,{"$f":"COUNTIF(H8:H52,\">=60\")-F59","v":17},null,null,{"$f":"COUNTIF(K8:K52,\">=60\")-I59","v":17},null,null,{"$f":"COUNTIF(N8:N52,\">=60\")-L59","v":17},null,null,{"$f":"COUNTIF(Q8:Q52,\">=60\")-O59","v":17},null,null,{"$f":"COUNTIF(T8:T52,\">=60\")-R59","v":17},null,null,{"$f":"COUNTIF(W8:W52,\">=60\")-U59","v":17},null,null,{"$f":"Home!B16","v":"HINDI"},{"$f":"F62","v":45},{"$f":"F60","v":45}]
["above 75%",null,{"$f":"COUNTIF(E8:E52,\">=75\")","v":23},null,null,{"$f":"COUNTIF(H8:H52,\">=75\")","v":23},null,null,{"$f":"COUNTIF(K8:K52,\">=75\")","v":23},null,null,{"$f":"COUNTIF(N8:N52,\">=75\")","v":23},null,null,{"$f":"COUNTIF(Q8:Q52,\">=75\")","v":23},null,null,{"$f":"COUNTIF(T8:T52,\">=75\")","v":23},null,null,{"$f":"COUNTIF(W8:W52,\">=75\")","v":23},null,null,{"$f":"Home!B17","v":"INFO PRACT"},{"$f":"I62","v":45},{"$f":"I60","v":45}]
["Appeared",null,{"$f":"COUNTIF(E8:E52,\">=0\")","v":45},null,null,{"$f":"COUNTIF(H8:H52,\">=0\")","v":45},null,null,{"$f":"COUNTIF(K8:K52,\">=0\")","v":45},null,null,{"$f":"COUNTIF(N8:N52,\">=0\")","v":45},null,null,{"$f":"COUNTIF(Q8:Q52,\">=0\")","v":45},null,null,{"$f":"COUNTIF(T8:T52,\">=0\")","v":45},null,null,{"$f":"COUNTIF(W8:W52,\">=0\")","v":45},null,null,{"$f":"Home!B18","v":"MATH"},{"$f":"L62","v":45},{"$f":"L60","v":45}]
["Passed",null,{"$f":"COUNTIF(E8:E52,\">=33\")","v":44},null,null,{"$f":"COUNTIF(H8:H52,\">=33\")","v":44},null,null,{"$f":"COUNTIF(K8:K52,\">=33\")","v":44},null,null,{"$f":"COUNTIF(N8:N52,\">=33\")","v":44},null,null,{"$f":"COUNTIF(Q8:Q52,\">=33\")","v":44},null,null,{"$f":"COUNTIF(T8:T52,\">=33\")","v":44},null,null,{"$f":"COUNTIF(W8:W52,\">=33\")","v":44},null,null,{"$f":"Home!B19","v":"CHEM"},{"$f":"O62","v":45},{"$f":"O60","v":45}]
["Total",null,{"$f":"C60+C63","v":45},null,null,{"$f":"F60+F63","v":45},null,null,{"$f":"I60+I63","v":45},null,null,{"$f":"L60+L63","v":45},null,null,{"$f":"O60+O63","v":45},null,null,{"$f":"R60+R63","v":45},null,null,{"$f":"U60+U63","v":45},null,null,{"$f":"Home!B20","v":"PHYSICS"},{"$f":"R62","v":45},{"$f":"R60","v":45}]
["Absent",null,{"$f":"COUNTIF(E8:E52,\"AB\")","v":0},null,null,{"$f":"COUNTIF(H8:H52,\"AB\")","v":0},null,null,{"$f":"COUNTIF(J8:J52,\"AB\")","v":0},null,null,{"$f":"COUNTIF(N8:N52,\"AB\")","v":0},null,null,{"$f":"COUNTIF(Q8:Q52,\"AB\")","v":0},null,null,{"$f":"COUNTIF(T8:T52,\"AB\")","v":0},null,null,{"$f":"COUNTIF(W8:W52,\"AB\")","v":0},null,null,{"$f":"Home!B21","v":"BIO"},{"$f":"U62","v":45},{"$f":"U60","v":45}]

{"sheet":"PREANNU PB2 ","index":8,"n_rows":63,"n_cols":26,"rows_kept":63,"cut":false,"hidden":false,"merged":[[62,0,62,1],[62,2,62,4],[62,5,62,7],[62,8,62,10],[62,11,62,13],[62,14,62,16],[62,17,62,19],[62,20,62,22],[60,2,60,4],[60,5,60,7],[60,8,60,10],[60,11,60,13],[60,14,60,16],[60,17,60,19],[60,20,60,22],[61,2,61,4],[61,5,61,7],[61,8,61,10],[61,11,61,13],[61,14,61,16],[61,17,61,19],[61,20,61,22],[58,17,58,19],[58,20,58,22],[59,2,59,4],[59,5,59,7],[59,8,59,10],[59,11,59,13],[59,14,59,16],[59,17,59,19],[59,20,59,22],[56,17,56,19],[56,20,56,22],[57,2,57,4],[57,5,57,7],[57,8,57,10],[57,11,57,13],[57,14,57,16],[57,17,57,19],[57,20,57,22],[52,25,55,25],[53,2,53,4],[53,5,53,7],[53,8,53,10],[53,11,53,13],[53,14,53,16],[53,17,53,19],[53,20,53,22],[54,2,54,4],[54,5,54,7],[54,8,54,10],[54,11,54,13],[54,14,54,16],[54,17,54,19],[54,20,54,22],[55,2,55,4],[55,5,55,7],[55,8,55,10],[55,11,55,13],[55,14,55,16],[55,17,55,19],[55,20,55,22],[52,2,52,4],[52,5,52,7],[52,8,52,10],[52,11,52,13],[52,14,52,16],[52,17,52,19],[52,20,52,22],[52,23,55,23],[52,24,55,24],[3,23,6,23],[3,24,6,24],[3,25,6,25],[4,2,4,3],[4,4,5,4],[4,5,4,6],[4,7,5,7],[4,8,4,9],[4,10,5,10],[4,11,4,12],[4,13,5,13],[4,14,4,15],[4,16,5,16],[4,17,4,18],[4,19,5,19],[4,20,4,21],[4,22,5,22],[3,0,6,0],[3,1,6,1],[3,2,3,4],[3,5,3,7],[3,8,3,10],[3,11,3,13],[3,14,3,16],[3,17,3,19],[3,20,3,22],[0,0,0,11],[0,12,0,25],[1,0,1,25],[2,0,2,5],[2,6,2,14],[2,15,2,25],[52,0,52,1],[53,0,53,1],[54,0,54,1],[56,0,56,1],[55,0,55,1],[56,2,56,4],[56,5,56,7],[56,8,56,10],[56,11,56,13],[56,14,56,16],[58,0,58,1],[57,0,57,1],[58,2,58,4],[58,5,58,7],[58,8,58,10],[58,11,58,13],[58,14,58,16],[61,0,61,1],[60,0,60,1],[59,0,59,1]]}
[{"$f":"Home!C7","v":"JAWAHAR NAVODAYA VIDYALAYA, "},null,null,null,null,null,null,null,null,null,null,null,{"$f":"Home!I7","v":"MOHINDERGARH"}]
["PRE ANNUAL/PREBOARD-2"]
[{"$f":"Home!C9","v":"XII A"},null,null,null,null,null,{"$f":"Home!C8","v":"2019-20"},null,null,null,null,null,null,null,null,"E"]
["ROLL NO.","STUDENT NAME",{"$f":"Home!B15","v":"ENGLISH"},null,null,{"$f":"Home!B16","v":"HINDI"},null,null,{"$f":"Home!B17","v":"INFO PRACT"},null,null,{"$f":"Home!B18","v":"MATH"},null,null,{"$f":"Home!B19","v":"CHEM"},null,null,{"$f":"Home!B20","v":"PHYSICS"},null,null,{"$f":"Home!B21","v":"BIO"},null,null,"MARKS \nOBT","%AGE","Rank"]
[null,null,"M.M",null,"%age","M.M",null,"%age","M.M",null,"%age","M.M",null,"%age","M.M",null,"%age","M.M",null,"%age","M.M",null,"%age"]
[null,null,"Th.","IA/ Prac.",null,"Th.","IA/ Prac.",null,"Th.","IA/ Prac.",null,"Th.","IA/ Prac.",null,"Th.","IA/ Prac.",null,"Th.","IA/ Prac.",null,"Th.","IA/ Prac."]
[null,null,40,20,100,40,20,100,40,20,100,40,20,100,40,20,100,40,20,100,40,20,100]
[{"$f":"'Student Profile'!A7","v":1},{"$f":"IF(('Student Profile'!C7)>0,'Student Profile'!C7,\"\")","v":"SUNIL KUMAR"},20,10,{"$f":"IF(OR(ISNUMBER(C8),ISNUMBER(D8)),ROUNDUP(SUM(C8:D8)/SUM($C$7,$D$7)*100,0),IF(C8=\"AB\",C8,\"\"))","v":50},20,10,{"$f":"IF(OR(ISNUMBER(F8),ISNUMBER(G8)),ROUNDUP(SUM(F8:G8)/SUM($F$7,$G$7)*100,0),IF(F8=\"AB\",F8,\"\"))","v":50},20,10,{"$f":"IF(OR(ISNUMBER(I8),ISNUMBER(J8)),ROUNDUP(SUM(I8:J8)/SUM($I$7,$J$7)*100,0),IF(I8=\"AB\",I8,\"\"))","v":50},20,10,{"$f":"IF(OR(ISNUMBER(L8),ISNUMBER(M8)),ROUNDUP(SUM(L8:M8)/SUM($L$7,$M$7)*100,0),IF(L8=\"AB\",L8,\"\"))","v":50},20,10,{"$f":"IF(OR(ISNUMBER(O8),ISNUMBER(P8)),ROUNDUP(SUM(O8:P8)/SUM($O$7,$P$7)*100,0),IF(O8=\"AB\",O8,\"\"))","v":50},20,10,{"$f":"IF(OR(ISNUMBER(R8),ISNUMBER(S8)),ROUNDUP(SUM(R8:S8)/SUM($R$7,$S$7)*100,0),IF(R8=\"AB\",R8,\"\"))","v":50},20,10,{"$f":"IF(OR(ISNUMBER(U8),ISNUMBER(V8)),ROUNDUP(SUM(U8:V8)/SUM($U$7,$V$7)*100,0),IF(U8=\"AB\",U8,\"\"))","v":50},{"$f":"IF(OR(ISNUMBER(E8),ISNUMBER(G8),ISNUMBER(J8),ISNUMBER(M8),ISNUMBER(P8),ISNUMBER(S8),ISNUMBER(V8)),SUM(E8,G8,J8,M8,P8,S8,V8),\"\")","v":110},{"$f":"IFERROR(X8/'Student Profile'!P7,\"\")","v":22},{"$f":"IFERROR(RANK(Y8,Y$8:Y$52,0),\"\")","v":42}]
[{"$f":"'Student Profile'!A8","v":""},{"$f":"IF(('Student Profile'!C8)>0,'Student Profile'!C8,\"\")","v":""},25,15,{"$f":"IF(OR(ISNUMBER(C9),ISNUMBER(D9)),ROUNDUP(SUM(C9:D9)/SUM($C$7,$D$7)*100,0),IF(C9=\"AB\",C9,\"\"))","v":67},25,15,{"$f":"IF(OR(ISNUMBER(F9),ISNUMBER(G9)),ROUNDUP(SUM(F9:G9)/SUM($F$7,$G$7)*100,0),IF(F9=\"AB\",F9,\"\"))","v":67},25,15,{"$f":"IF(OR(ISNUMBER(I9),ISNUMBER(J9)),ROUNDUP(SUM(I9:J9)/SUM($I$7,$J$7)*100,0),IF(I9=\"AB\",I9,\"\"))","v":67},25,15,{"$f":"IF(OR(ISNUMBER(L9),ISNUMBER(M9)),ROUNDUP(SUM(L9:M9)/SUM($L$7,$M$7)*100,0),IF(L9=\"AB\",L9,\"\"))","v":67},25,15,{"$f":"IF(OR(ISNUMBER(O9),ISNUMBER(P9)),ROUNDUP(SUM(O9:P9)/SUM($O$7,$P$7)*100,0),IF(O9=\"AB\",O9,\"\"))","v":67},25,15,{"$f":"IF(OR(ISNUMBER(R9),ISNUMBER(S9)),ROUNDUP(SUM(R9:S9)/SUM($R$7,$S$7)*100,0),IF(R9=\"AB\",R9,\"\"))","v":67},25,15,{"$f":"IF(OR(ISNUMBER(U9),ISNUMBER(V9)),ROUNDUP(SUM(U9:V9)/SUM($U$7,$V$7)*100,0),IF(U9=\"AB\",U9,\"\"))","v":67},{"$f":"IF(OR(ISNUMBER(E9),ISNUMBER(G9),ISNUMBER(J9),ISNUMBER(M9),ISNUMBER(P9),ISNUMBER(S9),ISNUMBER(V9)),SUM(E9,G9,J9,M9,P9,S9,V9),\"\")","v":157},{"$f":"IFERROR(X9/'Student Profile'!P8,\"\")","v":31.4},{"$f":"IF(ISNUMBER(Y9),RANK(X9,X$8:X$52,0),\"\")","v":32}]
[{"$f":"'Student Profile'!A9","v":""},{"$f":"IF(('Student Profile'!C9)>0,'Student Profile'!C9,\"\")","v":""},35,20,92,35,20,92,35,20,92,35,20,92,35,20,92,35,20,92,35,20,92,212,{"$f":"IFERROR(X10/'Student Profile'!P9,\"\")","v":42.4},1]
[{"$f":"'Student Profile'!A10","v":""},{"$f":"IF(('Student Profile'!C10)>0,'Student Profile'!C10,\"\")","v":""},25,17,70,25,17,70,25,17,70,25,17,70,25,17,70,25,17,70,25,17,70,172,{"$f":"IFERROR(X11/'Student Profile'!P10,\"\")","v":34.4},15]
[{"$f":"'Student Profile'!A11","v":""},{"$f":"IF(('Student Profile'!C11)>0,'Student Profile'!C11,\"\")","v":""},34,15,82,34,15,82,34,15,82,34,15,82,34,15,82,34,15,82,34,15,82,172,{"$f":"IFERROR(X12/'Student Profile'!P11,\"\")","v":34.4},15]
[{"$f":"'Student Profile'!A12","v":""},{"$f":"IF(('Student Profile'!C12)>0,'Student Profile'!C12,\"\")","v":""},36,15,85,36,15,85,36,15,85,36,15,85,36,15,85,36,15,85,36,15,85,175,{"$f":"IFERROR(X13/'Student Profile'!P12,\"\")","v":35},10]
[{"$f":"'Student Profile'!A13","v":""},{"$f":"IF(('Student Profile'!C13)>0,'Student Profile'!C13,\"\")","v":""},25,15,67,25,15,67,25,15,67,25,15,67,25,15,67,25,15,67,25,15,67,157,{"$f":"IFERROR(X14/'Student Profile'!P13,\"\")","v":31.4},32]
[{"$f":"'Student Profile'!A14","v":""},{"$f":"IF(('Student Profile'!C14)>0,'Student Profile'!C14,\"\")","v":""},34,15,82,34,15,82,34,15,82,34,15,82,34,15,82,34,15,82,34,15,82,172,{"$f":"IFERROR(X15/'Student Profile'!P14,\"\")","v":34.4},15]
[{"$f":"'Student Profile'!A15","v":""},{"$f":"IF(('Student Profile'!C15)>0,'Student Profile'!C15,\"\")","v":""},28,18,77,28,18,77,28,18,77,28,18,77,28,18,77,28,18,77,28,18,77,185,{"$f":"IFERROR(X16/'Student Profile'!P15,\"\")","v":37},5]
[{"$f":"'Student Profile'!A16","v":""},{"$f":"IF(('Student Profile'!C16)>0,'Student Profile'!C16,\"\")","v":""},29,15,74,29,15,74,29,15,74,29,15,74,29,15,74,29,15,74,29,15,74,164,{"$f":"IFERROR(X17/'Student Profile'!P16,\"\")","v":32.799999999999997},28]
[{"$f":"'Student Profile'!A17","v":""},{"$f":"IF(('Student Profile'!C17)>0,'Student Profile'!C17,\"\")","v":""},20,10,50,20,10,50,20,10,50,20,10,50,20,10,50,20,10,50,20,10,50,110,{"$f":"IFERROR(X18/'Student Profile'!P17,\"\")","v":22},42]
[{"$f":"'Student Profile'!A18","v":""},{"$f":"IF(('Student Profile'!C18)>0,'Student Profile'!C18,\"\")","v":""},25,15,67,25,15,67,25,15,67,25,15,67,25,15,67,25,15,67,25,15,67,157,{"$f":"IFERROR(X19/'Student Profile'!P18,\"\")","v":31.4},32]
[{"$f":"'Student Profile'!A19","v":""},{"$f":"IF(('Student Profile'!C19)>0,'Student Profile'!C19,\"\")","v":""},35,20,92,35,20,92,35,20,92,35,20,92,35,20,92,35,20,92,35,20,92,212,{"$f":"IFERROR(X20/'Student Profile'!P19,\"\")","v":42.4},1]
[{"$f":"'Student Profile'!A20","v":""},{"$f":"IF(('Student Profile'!C20)>0,'Student Profile'!C20,\"\")","v":""},25,17,70,25,17,70,25,17,70,25,17,70,25,17,70,25,17,70,25,17,70,172,{"$f":"IFERROR(X21/'Student Profile'!P20,\"\")","v":34.4},15]
[{"$f":"'Student Profile'!A21","v":""},{"$f":"IF(('Student Profile'!C21)>0,'Student Profile'!C21,\"\")","v":""},34,15,82,34,15,82,34,15,82,34,15,82,34,15,82,34,15,82,34,15,82,172,{"$f":"IFERROR(X22/'Student Profile'!P21,\"\")","v":34.4},15]
[{"$f":"'Student Profile'!A22","v":""},{"$f":"IF(('Student Profile'!C22)>0,'Student Profile'!C22,\"\")","v":""},36,15,85,36,15,85,36,15,85,36,15,85,36,15,85,36,15,85,36,15,85,175,{"$f":"IFERROR(X23/'Student Profile'!P22,\"\")","v":35},10]
[{"$f":"'Student Profile'!A23","v":""},{"$f":"IF(('Student Profile'!C23)>0,'Student Profile'!C23,\"\")","v":""},25,15,67,25,15,67,25,15,67,25,15,67,25,15,67,25,15,67,25,15,67,157,{"$f":"IFERROR(X24/'Student Profile'!P23,\"\")","v":31.4},32]
[{"$f":"'Student Profile'!A24","v":""},{"$f":"IF(('Student Profile'!C24)>0,'Student Profile'!C24,\"\")","v":""},34,15,82,34,15,82,34,15,82,34,15,82,34,15,82,34,15,82,34,15,82,172,{"$f":"IFERROR(X25/'Student Profile'!P24,\"\")","v":34.4},15]
[{"$f":"'Student Profile'!A25","v":""},{"$f":"IF(('Student Profile'!C25)>0,'Student Profile'!C25,\"\")","v":""},28,18,77,28,18,77,28,18,77,28,18,77,28,18,77,28,18,77,28,18,77,185,{"$f":"IFERROR(X26/'Student Profile'!P25,\"\")","v":37},5]
[{"$f":"'Student Profile'!A26","v":""},{"$f":"IF(('Student Profile'!C26)>0,'Student Profile'!C26,\"\")","v":""},29,15,74,29,15,74,29,15,74,29,15,74,29,15,74,29,15,74,29,15,74,164,{"$f":"IFERROR(X27/'Student Profile'!P26,\"\")","v":32.799999999999997},28]
[{"$f":"'Student Profile'!A27","v":""},{"$f":"IF(('Student Profile'!C27)>0,'Student Profile'!C27,\"\")","v":""},20,10,50,20,10,50,20,10,50,20,10,50,20,10,50,20,10,50,20,10,50,110,{"$f":"IFERROR(X28/'Student Profile'!P27,\"\")","v":22},42]
[{"$f":"'Student Profile'!A28","v":""},{"$f":"IF(('Student Profile'!C28)>0,'Student Profile'!C28,\"\")","v":""},25,15,67,25,15,67,25,15,67,25,15,67,25,15,67,25,15,67,25,15,67,157,{"$f":"IFERROR(X29/'Student Profile'!P28,\"\")","v":31.4},32]
[{"$f":"'Student Profile'!A29","v":""},{"$f":"IF(('Student Profile'!C29)>0,'Student Profile'!C29,\"\")","v":""},35,20,92,35,20,92,35,20,92,35,20,92,35,20,92,35,20,92,35,20,92,212,{"$f":"IFERROR(X30/'Student Profile'!P29,\"\")","v":42.4},1]
[{"$f":"'Student Profile'!A30","v":""},{"$f":"IF(('Student Profile'!C30)>0,'Student Profile'!C30,\"\")","v":""},25,17,70,25,17,70,25,17,70,25,17,70,25,17,70,25,17,70,25,17,70,172,{"$f":"IFERROR(X31/'Student Profile'!P30,\"\")","v":34.4},15]
[{"$f":"'Student Profile'!A31","v":""},{"$f":"IF(('Student Profile'!C31)>0,'Student Profile'!C31,\"\")","v":""},34,15,82,34,15,82,34,15,82,34,15,82,34,15,82,34,15,82,34,15,82,172,{"$f":"IFERROR(X32/'Student Profile'!P31,\"\")","v":34.4},15]
[{"$f":"'Student Profile'!A32","v":""},{"$f":"IF(('Student Profile'!C32)>0,'Student Profile'!C32,\"\")","v":""},36,15,85,36,15,85,36,15,85,36,15,85,36,15,85,36,15,85,36,15,85,175,{"$f":"IFERROR(X33/'Student Profile'!P32,\"\")","v":35},10]
[{"$f":"'Student Profile'!A33","v":""},{"$f":"IF(('Student Profile'!C33)>0,'Student Profile'!C33,\"\")","v":""},25,15,67,25,15,67,25,15,67,25,15,67,25,15,67,25,15,67,25,15,67,157,{"$f":"IFERROR(X34/'Student Profile'!P33,\"\")","v":31.4},32]
[{"$f":"'Student Profile'!A34","v":""},{"$f":"IF(('Student Profile'!C34)>0,'Student Profile'!C34,\"\")","v":""},34,15,82,34,15,82,34,15,82,34,15,82,34,15,82,34,15,82,34,15,82,172,{"$f":"IFERROR(X35/'Student Profile'!P34,\"\")","v":34.4},15]
[{"$f":"'Student Profile'!A35","v":""},{"$f":"IF(('Student Profile'!C35)>0,'Student Profile'!C35,\"\")","v":""},28,18,77,28,18,77,28,18,77,28,18,77,28,18,77,28,18,77,28,18,77,185,{"$f":"IFERROR(X36/'Student Profile'!P35,\"\")","v":37},5]
[{"$f":"'Student Profile'!A36","v":""},{"$f":"IF(('Student Profile'!C36)>0,'Student Profile'!C36,\"\")","v":""},29,15,74,29,15,74,29,15,74,29,15,74,29,15,74,29,15,74,29,15,74,164,{"$f":"IFERROR(X37/'Student Profile'!P36,\"\")","v":32.799999999999997},28]
[{"$f":"'Student Profile'!A37","v":""},{"$f":"IF(('Student Profile'!C37)>0,'Student Profile'!C37,\"\")","v":""},20,10,50,20,10,50,20,10,50,20,10,50,20,10,50,20,10,50,20,10,50,110,{"$f":"IFERROR(X38/'Student Profile'!P37,\"\")","v":22},42]
[{"$f":"'Student Profile'!A38","v":""},{"$f":"IF(('Student Profile'!C38)>0,'Student Profile'!C38,\"\")","v":""},25,15,67,25,15,67,25,15,67,25,15,67,25,15,67,25,15,67,25,15,67,157,{"$f":"IFERROR(X39/'Student Profile'!P38,\"\")","v":31.4},32]
[{"$f":"'Student Profile'!A39","v":""},{"$f":"IF(('Student Profile'!C39)>0,'Student Profile'!C39,\"\")","v":""},35,20,92,35,20,92,35,20,92,35,20,92,35,20,92,35,20,92,35,20,92,212,{"$f":"IFERROR(X40/'Student Profile'!P39,\"\")","v":42.4},1]
[{"$f":"'Student Profile'!A40","v":""},{"$f":"IF(('Student Profile'!C40)>0,'Student Profile'!C40,\"\")","v":""},25,17,70,25,17,70,25,17,70,25,17,70,25,17,70,25,17,70,25,17,70,172,{"$f":"IFERROR(X41/'Student Profile'!P40,\"\")","v":34.4},15]
[{"$f":"'Student Profile'!A41","v":""},{"$f":"IF(('Student Profile'!C41)>0,'Student Profile'!C41,\"\")","v":""},34,15,82,34,15,82,34,15,82,34,15,82,34,15,82,34,15,82,34,15,82,172,{"$f":"IFERROR(X42/'Student Profile'!P41,\"\")","v":34.4},15]
[{"$f":"'Student Profile'!A42","v":""},{"$f":"IF(('Student Profile'!C42)>0,'Student Profile'!C42,\"\")","v":""},36,15,85,36,15,85,36,15,85,36,15,85,36,15,85,36,15,85,36,15,85,175,{"$f":"IFERROR(X43/'Student Profile'!P42,\"\")","v":35},10]
[{"$f":"'Student Profile'!A43","v":""},{"$f":"IF(('Student Profile'!C43)>0,'Student Profile'!C43,\"\")","v":""},25,15,67,25,15,67,25,15,67,25,15,67,25,15,67,25,15,67,25,15,67,157,{"$f":"IFERROR(X44/'Student Profile'!P43,\"\")","v":31.4},32]
[{"$f":"'Student Profile'!A44","v":""},{"$f":"IF(('Student Profile'!C44)>0,'Student Profile'!C44,\"\")","v":""},34,15,82,34,15,82,34,15,82,34,15,82,34,15,82,34,15,82,34,15,82,172,{"$f":"IFERROR(X45/'Student Profile'!P44,\"\")","v":34.4},15]
[{"$f":"'Student Profile'!A45","v":""},{"$f":"IF(('Student Profile'!C45)>0,'Student Profile'!C45,\"\")","v":""},28,18,77,28,18,77,28,18,77,28,18,77,28,18,77,28,18,77,28,18,77,185,{"$f":"IFERROR(X46/'Student Profile'!P45,\"\")","v":37},5]
[{"$f":"'Student Profile'!A46","v":""},{"$f":"IF(('Student Profile'!C46)>0,'Student Profile'!C46,\"\")","v":""},29,15,74,29,15,74,29,15,74,29,15,74,29,15,74,29,15,74,29,15,74,164,{"$f":"IFERROR(X47/'Student Profile'!P46,\"\")","v":32.799999999999997},28]
[{"$f":"'Student Profile'!A47","v":""},{"$f":"IF(('Student Profile'!C47)>0,'Student Profile'!C47,\"\")","v":""},36,15,85,36,15,85,36,15,85,36,15,85,36,15,85,36,15,85,36,15,85,175,{"$f":"IFERROR(X48/'Student Profile'!P47,\"\")","v":35},10]
[{"$f":"'Student Profile'!A48","v":""},{"$f":"IF(('Student Profile'!C48)>0,'Student Profile'!C48,\"\")","v":""},25,15,67,25,15,67,25,15,67,25,15,67,25,15,67,25,15,67,25,15,67,157,{"$f":"IFERROR(X49/'Student Profile'!P48,\"\")","v":31.4},32]
[{"$f":"'Student Profile'!A49","v":""},{"$f":"IF(('Student Profile'!C49)>0,'Student Profile'!C49,\"\")","v":""},34,15,82,34,15,82,34,15,82,34,15,82,34,15,82,34,15,82,34,15,82,172,{"$f":"IFERROR(X50/'Student Profile'!P49,\"\")","v":34.4},15]
[{"$f":"'Student Profile'!A50","v":""},{"$f":"IF(('Student Profile'!C50)>0,'Student Profile'!C50,\"\")","v":""},28,18,77,28,18,77,28,18,77,28,18,77,28,18,77,28,18,77,28,18,77,185,{"$f":"IFERROR(X51/'Student Profile'!P50,\"\")","v":37},5]
[{"$f":"'Student Profile'!A51","v":""},{"$f":"IF(('Student Profile'!C51)>0,'Student Profile'!C51,\"\")","v":""},"AB",12,20,"AB",12,20,"AB",12,20,"AB",12,20,"AB",12,20,"AB",12,20,"AB",12,20,{"$f":"IF(OR(ISNUMBER(E52),ISNUMBER(H52),ISNUMBER(K52),ISNUMBER(N52),ISNUMBER(Q52),ISNUMBER(T52),ISNUMBER(W52)),SUM(E52,H52,K52,N52,Q52,T52,Q52),\"\")","v":140},{"$f":"IFERROR(X52/'Student Profile'!P51,\"\")","v":28},41]
["Subject Avg.",null,{"$f":"IF(AND(ISNUMBER(Z57),Z57>0),SUM(E8:E52)/C60,\"\")","v":73.666666666666671},null,null,{"$f":"IF(AND(ISNUMBER(Z58),Z58>0),SUM(H8:H52)/F60,\"\")","v":73.666666666666671},null,null,{"$f":"IF(AND(ISNUMBER(Z59),Z59>0),SUM(K8:K52)/I60,\"\")","v":73.666666666666671},null,null,{"$f":"IF(AND(ISNUMBER(Z60),Z60>0),SUM(N8:N52)/L60,\"\")","v":73.666666666666671},null,null,{"$f":"IF(AND(ISNUMBER(Z61),Z61>0),SUM(Q8:Q52)/O60,\"\")","v":73.666666666666671},null,null,{"$f":"IF(AND(ISNUMBER(Z62),Z62>0),SUM(T8:T52)/R60,\"\")","v":73.666666666666671},null,null,{"$f":"IF(AND(ISNUMBER(AO58),AO58>0),SUM(W8:W52)/U60,\"\")","v":""},null,null,"SUBJECTS","Total Student","Present"]
["Pass %age",null,{"$f":"IF(ISNUMBER(C53),(C61/C60)*100,\"0\")","v":97.777777777777771},null,null,{"$f":"IF(ISNUMBER(F53),F61/F60*100,\"0\")","v":97.777777777777771},null,null,{"$f":"IF(ISNUMBER(I53),I61/I60*100,\"0\")","v":97.777777777777771},null,null,{"$f":"IF(ISNUMBER(L53),L61/L60*100,\"0\")","v":97.777777777777771},null,null,{"$f":"IF(ISNUMBER(O53),O61/O60*100,\"0\")","v":97.777777777777771},null,null,{"$f":"IF(ISNUMBER(R53),R61/R60*100,\"0\")","v":97.777777777777771},null,null,{"$f":"IF(ISNUMBER(U53),U61/U60*100,\"0\")","v":"0"}]
["Below 33%",null,{"$f":"COUNTIF(E8:E52,\"<33\")","v":1},null,null,{"$f":"COUNTIF(H8:H52,\"<33\")","v":1},null,null,{"$f":"COUNTIF(K8:K52,\"<33\")","v":1},null,null,{"$f":"COUNTIF(N8:N52,\"<33\")","v":1},null,null,{"$f":"COUNTIF(Q8:Q52,\"<33\")","v":1},null,null,{"$f":"COUNTIF(T8:T52,\"<33\")","v":1},null,null,{"$f":"COUNTIF(V8:V52,\"<33\")","v":45}]
["33% to 50%",null,{"$f":"COUNTIF(E8:E52,\">=33\")-C57-C58-C59","v":0},null,null,{"$f":"COUNTIF(H8:H52,\">=33\")-F57-F58-F59","v":0},null,null,{"$f":"COUNTIF(K8:K52,\">=33\")-I57-I58-I59","v":0},null,null,{"$f":"COUNTIF(N8:N52,\">=33\")-L57-L58-L59","v":0},null,null,{"$f":"COUNTIF(Q8:Q52,\">=33\")-O57-O58-O59","v":0},null,null,{"$f":"COUNTIF(T8:T52,\">=33\")-R57-R58-R59","v":0},null,null,{"$f":"COUNTIF(W8:W52,\">=33\")-U57-U58-U59","v":0}]
["50% to 60%",null,{"$f":"COUNTIF(E8:E52,\">=50\")-C58-C59","v":4},null,null,{"$f":"COUNTIF(H8:H52,\">=50\")-F58-F59","v":4},null,null,{"$f":"COUNTIF(K8:K52,\">=50\")-I58-I59","v":4},null,null,{"$f":"COUNTIF(N8:N52,\">=50\")-L58-L59","v":4},null,null,{"$f":"COUNTIF(Q8:Q52,\">=50\")-O58-O59","v":4},null,null,{"$f":"COUNTIF(T8:T52,\">=50\")-R58-R59","v":4},null,null,{"$f":"COUNTIF(W8:W52,\">=50\")-U58-U59","v":4},null,null,{"$f":"Home!B15","v":"ENGLISH"},{"$f":"C62","v":45},{"$f":"C60","v":45}]
["60% to 75%",null,{"$f":"COUNTIF(E8:E52,\">=60\")-C59","v":17},null,null,{"$f":"COUNTIF(H8:H52,\">=60\")-F59","v":17},null,null,{"$f":"COUNTIF(K8:K52,\">=60\")-I59","v":17},null,null,{"$f":"COUNTIF(N8:N52,\">=60\")-L59","v":17},null,null,{"$f":"COUNTIF(Q8:Q52,\">=60\")-O59","v":17},null,null,{"$f":"COUNTIF(T8:T52,\">=60\")-R59","v":17},null,null,{"$f":"COUNTIF(W8:W52,\">=60\")-U59","v":17},null,null,{"$f":"Home!B16","v":"HINDI"},{"$f":"F62","v":45},{"$f":"F60","v":45}]
["above 75%",null,{"$f":"COUNTIF(E8:E52,\">=75\")","v":23},null,null,{"$f":"COUNTIF(H8:H52,\">=75\")","v":23},null,null,{"$f":"COUNTIF(K8:K52,\">=75\")","v":23},null,null,{"$f":"COUNTIF(N8:N52,\">=75\")","v":23},null,null,{"$f":"COUNTIF(Q8:Q52,\">=75\")","v":23},null,null,{"$f":"COUNTIF(T8:T52,\">=75\")","v":23},null,null,{"$f":"COUNTIF(W8:W52,\">=75\")","v":23},null,null,{"$f":"Home!B17","v":"INFO PRACT"},{"$f":"I62","v":45},{"$f":"I60","v":45}]
["Appeared",null,{"$f":"COUNTIF(E8:E52,\">=0\")","v":45},null,null,{"$f":"COUNTIF(H8:H52,\">=0\")","v":45},null,null,{"$f":"COUNTIF(K8:K52,\">=0\")","v":45},null,null,{"$f":"COUNTIF(N8:N52,\">=0\")","v":45},null,null,{"$f":"COUNTIF(Q8:Q52,\">=0\")","v":45},null,null,{"$f":"COUNTIF(T8:T52,\">=0\")","v":45},null,null,{"$f":"COUNTIF(W8:W52,\">=0\")","v":45},null,null,{"$f":"Home!B18","v":"MATH"},{"$f":"L62","v":45},{"$f":"L60","v":45}]
["Passed",null,{"$f":"COUNTIF(E8:E52,\">=33\")","v":44},null,null,{"$f":"COUNTIF(H8:H52,\">=33\")","v":44},null,null,{"$f":"COUNTIF(K8:K52,\">=33\")","v":44},null,null,{"$f":"COUNTIF(N8:N52,\">=33\")","v":44},null,null,{"$f":"COUNTIF(Q8:Q52,\">=33\")","v":44},null,null,{"$f":"COUNTIF(T8:T52,\">=33\")","v":44},null,null,{"$f":"COUNTIF(W8:W52,\">=33\")","v":44},null,null,{"$f":"Home!B19","v":"CHEM"},{"$f":"O62","v":45},{"$f":"O60","v":45}]
["Total",null,{"$f":"C60+C63","v":45},null,null,{"$f":"F60+F63","v":45},null,null,{"$f":"I60+I63","v":45},null,null,{"$f":"L60+L63","v":45},null,null,{"$f":"O60+O63","v":45},null,null,{"$f":"R60+R63","v":45},null,null,{"$f":"U60+U63","v":45},null,null,{"$f":"Home!B20","v":"PHYSICS"},{"$f":"R62","v":45},{"$f":"R60","v":45}]
["Absent",null,{"$f":"COUNTIF(E8:E52,\"AB\")","v":0},null,null,{"$f":"COUNTIF(H8:H52,\"AB\")","v":0},null,null,{"$f":"COUNTIF(J8:J52,\"AB\")","v":0},null,null,{"$f":"COUNTIF(N8:N52,\"AB\")","v":0},null,null,{"$f":"COUNTIF(Q8:Q52,\"AB\")","v":0},null,null,{"$f":"COUNTIF(T8:T52,\"AB\")","v":0},null,null,{"$f":"COUNTIF(W8:W52,\"AB\")","v":0},null,null,{"$f":"Home!B21","v":"BIO"},{"$f":"U62","v":45},{"$f":"U60","v":45}]

{"sheet":"ANNUAL","index":9,"n_rows":63,"n_cols":26,"rows_kept":63,"cut":false,"hidden":false,"merged":[[62,0,62,1],[62,2,62,4],[62,5,62,7],[62,8,62,10],[62,11,62,13],[62,14,62,16],[62,17,62,19],[62,20,62,22],[60,2,60,4],[60,5,60,7],[60,8,60,10],[60,11,60,13],[60,14,60,16],[60,17,60,19],[60,20,60,22],[61,2,61,4],[61,5,61,7],[61,8,61,10],[61,11,61,13],[61,14,61,16],[61,17,61,19],[61,20,61,22],[58,17,58,19],[58,20,58,22],[59,2,59,4],[59,5,59,7],[59,8,59,10],[59,11,59,13],[59,14,59,16],[59,17,59,19],[59,20,59,22],[56,17,56,19],[56,20,56,22],[57,2,57,4],[57,5,57,7],[57,8,57,10],[57,11,57,13],[57,14,57,16],[57,17,57,19],[57,20,57,22],[52,25,55,25],[53,2,53,4],[53,5,53,7],[53,8,53,10],[53,11,53,13],[53,14,53,16],[53,17,53,19],[53,20,53,22],[54,2,54,4],[54,5,54,7],[54,8,54,10],[54,11,54,13],[54,14,54,16],[54,17,54,19],[54,20,54,22],[55,2,55,4],[55,5,55,7],[55,8,55,10],[55,11,55,13],[55,14,55,16],[55,17,55,19],[55,20,55,22],[52,2,52,4],[52,5,52,7],[52,8,52,10],[52,11,52,13],[52,14,52,16],[52,17,52,19],[52,20,52,22],[52,23,55,23],[52,24,55,24],[3,23,6,23],[3,24,6,24],[3,25,6,25],[4,2,4,3],[4,4,5,4],[4,5,4,6],[4,7,5,7],[4,8,4,9],[4,10,5,10],[4,11,4,12],[4,13,5,13],[4,14,4,15],[4,16,5,16],[4,17,4,18],[4,19,5,19],[4,20,4,21],[4,22,5,22],[3,0,6,0],[3,1,6,1],[3,2,3,4],[3,5,3,7],[3,8,3,10],[3,11,3,13],[3,14,3,16],[3,17,3,19],[3,20,3,22],[0,0,0,11],[0,12,0,25],[1,0,1,25],[2,0,2,5],[2,6,2,14],[2,15,2,25],[52,0,52,1],[53,0,53,1],[54,0,54,1],[56,0,56,1],[55,0,55,1],[56,2,56,4],[56,5,56,7],[56,8,56,10],[56,11,56,13],[56,14,56,16],[58,0,58,1],[57,0,57,1],[58,2,58,4],[58,5,58,7],[58,8,58,10],[58,11,58,13],[58,14,58,16],[61,0,61,1],[60,0,60,1],[59,0,59,1]]}
[{"$f":"Home!C7","v":"JAWAHAR NAVODAYA VIDYALAYA, "},null,null,null,null,null,null,null,null,null,null,null,{"$f":"Home!I7","v":"MOHINDERGARH"}]
["ANNUAL EXAM"]
[{"$f":"Home!C9","v":"XII A"},null,null,null,null,null,{"$f":"Home!C8","v":"2019-20"},null,null,null,null,null,null,null,null,"E"]
["ROLL NO.","STUDENT NAME",{"$f":"Home!B15","v":"ENGLISH"},null,null,{"$f":"Home!B16","v":"HINDI"},null,null,{"$f":"Home!B17","v":"INFO PRACT"},null,null,{"$f":"Home!B18","v":"MATH"},null,null,{"$f":"Home!B19","v":"CHEM"},null,null,{"$f":"Home!B20","v":"PHYSICS"},null,null,{"$f":"Home!B21","v":"BIO"},null,null,"MARKS \nOBT","%AGE","Rank"]
[null,null,"M.M",null,"%age","M.M",null,"%age","M.M",null,"%age","M.M",null,"%age","M.M",null,"%age","M.M",null,"%age","M.M",null,"%age"]
[null,null,"Th.","IA/ Prac.",null,"Th.","IA/ Prac.",null,"Th.","IA/ Prac.",null,"Th.","IA/ Prac.",null,"Th.","IA/ Prac.",null,"Th.","IA/ Prac.",null,"Th.","IA/ Prac."]
[null,null,70,30,100,40,20,100,40,20,100,40,20,100,40,20,100,40,20,100,40,20,100]
[{"$f":"'Student Profile'!A7","v":1},{"$f":"IF(('Student Profile'!C7)>0,'Student Profile'!C7,\"\")","v":"SUNIL KUMAR"},20,10,{"$f":"IF(OR(ISNUMBER(C8),ISNUMBER(D8)),ROUNDUP(SUM(C8:D8)/SUM($C$7,$D$7)*100,0),IF(C8=\"AB\",C8,\"\"))","v":30},20,10,{"$f":"IF(OR(ISNUMBER(F8),ISNUMBER(G8)),ROUNDUP(SUM(F8:G8)/SUM($F$7,$G$7)*100,0),IF(F8=\"AB\",F8,\"\"))","v":50},20,10,{"$f":"IF(OR(ISNUMBER(I8),ISNUMBER(J8)),ROUNDUP(SUM(I8:J8)/SUM($I$7,$J$7)*100,0),IF(I8=\"AB\",I8,\"\"))","v":50},20,10,{"$f":"IF(OR(ISNUMBER(L8),ISNUMBER(M8)),ROUNDUP(SUM(L8:M8)/SUM($L$7,$M$7)*100,0),IF(L8=\"AB\",L8,\"\"))","v":50},20,10,{"$f":"IF(OR(ISNUMBER(O8),ISNUMBER(P8)),ROUNDUP(SUM(O8:P8)/SUM($O$7,$P$7)*100,0),IF(O8=\"AB\",O8,\"\"))","v":50},20,10,{"$f":"IF(OR(ISNUMBER(R8),ISNUMBER(S8)),ROUNDUP(SUM(R8:S8)/SUM($R$7,$S$7)*100,0),IF(R8=\"AB\",R8,\"\"))","v":50},20,10,{"$f":"IF(OR(ISNUMBER(U8),ISNUMBER(V8)),ROUNDUP(SUM(U8:V8)/SUM($U$7,$V$7)*100,0),IF(U8=\"AB\",U8,\"\"))","v":50},{"$f":"IF(OR(ISNUMBER(E8),ISNUMBER(G8),ISNUMBER(J8),ISNUMBER(M8),ISNUMBER(P8),ISNUMBER(S8),ISNUMBER(V8)),SUM(E8,G8,J8,M8,P8,S8,V8),\"\")","v":90},{"$f":"IFERROR(X8/'Student Profile'!P7,\"\")","v":18},{"$f":"IFERROR(RANK(Y8,Y$8:Y$52,0),\"\")","v":42}]
[{"$f":"'Student Profile'!A8","v":""},{"$f":"IF(('Student Profile'!C8)>0,'Student Profile'!C8,\"\")","v":""},25,15,{"$f":"IF(OR(ISNUMBER(C9),ISNUMBER(D9)),ROUNDUP(SUM(C9:D9)/SUM($C$7,$D$7)*100,0),IF(C9=\"AB\",C9,\"\"))","v":40},25,15,{"$f":"IF(OR(ISNUMBER(F9),ISNUMBER(G9)),ROUNDUP(SUM(F9:G9)/SUM($F$7,$G$7)*100,0),IF(F9=\"AB\",F9,\"\"))","v":67},25,15,{"$f":"IF(OR(ISNUMBER(I9),ISNUMBER(J9)),ROUNDUP(SUM(I9:J9)/SUM($I$7,$J$7)*100,0),IF(I9=\"AB\",I9,\"\"))","v":67},25,15,{"$f":"IF(OR(ISNUMBER(L9),ISNUMBER(M9)),ROUNDUP(SUM(L9:M9)/SUM($L$7,$M$7)*100,0),IF(L9=\"AB\",L9,\"\"))","v":67},25,15,{"$f":"IF(OR(ISNUMBER(O9),ISNUMBER(P9)),ROUNDUP(SUM(O9:P9)/SUM($O$7,$P$7)*100,0),IF(O9=\"AB\",O9,\"\"))","v":67},25,15,{"$f":"IF(OR(ISNUMBER(R9),ISNUMBER(S9)),ROUNDUP(SUM(R9:S9)/SUM($R$7,$S$7)*100,0),IF(R9=\"AB\",R9,\"\"))","v":67},25,15,{"$f":"IF(OR(ISNUMBER(U9),ISNUMBER(V9)),ROUNDUP(SUM(U9:V9)/SUM($U$7,$V$7)*100,0),IF(U9=\"AB\",U9,\"\"))","v":67},{"$f":"IF(OR(ISNUMBER(E9),ISNUMBER(G9),ISNUMBER(J9),ISNUMBER(M9),ISNUMBER(P9),ISNUMBER(S9),ISNUMBER(V9)),SUM(E9,G9,J9,M9,P9,S9,V9),\"\")","v":130},{"$f":"IFERROR(X9/'Student Profile'!P8,\"\")","v":26},{"$f":"IF(ISNUMBER(Y9),RANK(X9,X$8:X$52,0),\"\")","v":33}]
[{"$f":"'Student Profile'!A9","v":""},{"$f":"IF(('Student Profile'!C9)>0,'Student Profile'!C9,\"\")","v":""},35,20,55,35,20,92,35,20,92,35,20,92,35,20,92,35,20,92,35,20,92,175,{"$f":"IFERROR(X10/'Student Profile'!P9,\"\")","v":35},1]
[{"$f":"'Student Profile'!A10","v":""},{"$f":"IF(('Student Profile'!C10)>0,'Student Profile'!C10,\"\")","v":""},25,17,42,25,17,70,25,17,70,25,17,70,25,17,70,25,17,70,25,17,70,144,{"$f":"IFERROR(X11/'Student Profile'!P10,\"\")","v":28.8},10]
[{"$f":"'Student Profile'!A11","v":""},{"$f":"IF(('Student Profile'!C11)>0,'Student Profile'!C11,\"\")","v":""},34,15,49,34,15,82,34,15,82,34,15,82,34,15,82,34,15,82,34,15,82,139,{"$f":"IFERROR(X12/'Student Profile'!P11,\"\")","v":27.8},19]
[{"$f":"'Student Profile'!A12","v":""},{"$f":"IF(('Student Profile'!C12)>0,'Student Profile'!C12,\"\")","v":""},36,15,51,36,15,85,36,15,85,36,15,85,36,15,85,36,15,85,36,15,85,141,{"$f":"IFERROR(X13/'Student Profile'!P12,\"\")","v":28.2},14]
[{"$f":"'Student Profile'!A13","v":""},{"$f":"IF(('Student Profile'!C13)>0,'Student Profile'!C13,\"\")","v":""},25,15,40,25,15,67,25,15,67,25,15,67,25,15,67,25,15,67,25,15,67,130,{"$f":"IFERROR(X14/'Student Profile'!P13,\"\")","v":26},33]
[{"$f":"'Student Profile'!A14","v":""},{"$f":"IF(('Student Profile'!C14)>0,'Student Profile'!C14,\"\")","v":""},34,15,49,34,15,82,34,15,82,34,15,82,34,15,82,34,15,82,34,15,82,139,{"$f":"IFERROR(X15/'Student Profile'!P14,\"\")","v":27.8},19]
[{"$f":"'Student Profile'!A15","v":""},{"$f":"IF(('Student Profile'!C15)>0,'Student Profile'!C15,\"\")","v":""},28,18,46,28,18,77,28,18,77,28,18,77,28,18,77,28,18,77,28,18,77,154,{"$f":"IFERROR(X16/'Student Profile'!P15,\"\")","v":30.8},5]
[{"$f":"'Student Profile'!A16","v":""},{"$f":"IF(('Student Profile'!C16)>0,'Student Profile'!C16,\"\")","v":""},29,15,44,29,15,74,29,15,74,29,15,74,29,15,74,29,15,74,29,15,74,134,{"$f":"IFERROR(X17/'Student Profile'!P16,\"\")","v":26.8},28]
[{"$f":"'Student Profile'!A17","v":""},{"$f":"IF(('Student Profile'!C17)>0,'Student Profile'!C17,\"\")","v":""},20,10,30,20,10,50,20,10,50,20,10,50,20,10,50,20,10,50,20,10,50,90,{"$f":"IFERROR(X18/'Student Profile'!P17,\"\")","v":18},42]
[{"$f":"'Student Profile'!A18","v":""},{"$f":"IF(('Student Profile'!C18)>0,'Student Profile'!C18,\"\")","v":""},25,15,40,25,15,67,25,15,67,25,15,67,25,15,67,25,15,67,25,15,67,130,{"$f":"IFERROR(X19/'Student Profile'!P18,\"\")","v":26},33]
[{"$f":"'Student Profile'!A19","v":""},{"$f":"IF(('Student Profile'!C19)>0,'Student Profile'!C19,\"\")","v":""},35,20,55,35,20,92,35,20,92,35,20,92,35,20,92,35,20,92,35,20,92,175,{"$f":"IFERROR(X20/'Student Profile'!P19,\"\")","v":35},1]
[{"$f":"'Student Profile'!A20","v":""},{"$f":"IF(('Student Profile'!C20)>0,'Student Profile'!C20,\"\")","v":""},25,17,42,25,17,70,25,17,70,25,17,70,25,17,70,25,17,70,25,17,70,144,{"$f":"IFERROR(X21/'Student Profile'!P20,\"\")","v":28.8},10]
[{"$f":"'Student Profile'!A21","v":""},{"$f":"IF(('Student Profile'!C21)>0,'Student Profile'!C21,\"\")","v":""},34,15,49,34,15,82,34,15,82,34,15,82,34,15,82,34,15,82,34,15,82,139,{"$f":"IFERROR(X22/'Student Profile'!P21,\"\")","v":27.8},19]
[{"$f":"'Student Profile'!A22","v":""},{"$f":"IF(('Student Profile'!C22)>0,'Student Profile'!C22,\"\")","v":""},36,15,51,36,15,85,36,15,85,36,15,85,36,15,85,36,15,85,36,15,85,141,{"$f":"IFERROR(X23/'Student Profile'!P22,\"\")","v":28.2},14]
[{"$f":"'Student Profile'!A23","v":""},{"$f":"IF(('Student Profile'!C23)>0,'Student Profile'!C23,\"\")","v":""},25,15,40,25,15,67,25,15,67,25,15,67,25,15,67,25,15,67,25,15,67,130,{"$f":"IFERROR(X24/'Student Profile'!P23,\"\")","v":26},33]
[{"$f":"'Student Profile'!A24","v":""},{"$f":"IF(('Student Profile'!C24)>0,'Student Profile'!C24,\"\")","v":""},34,15,49,34,15,82,34,15,82,34,15,82,34,15,82,34,15,82,34,15,82,139,{"$f":"IFERROR(X25/'Student Profile'!P24,\"\")","v":27.8},19]
[{"$f":"'Student Profile'!A25","v":""},{"$f":"IF(('Student Profile'!C25)>0,'Student Profile'!C25,\"\")","v":""},28,18,46,28,18,77,28,18,77,28,18,77,28,18,77,28,18,77,28,18,77,154,{"$f":"IFERROR(X26/'Student Profile'!P25,\"\")","v":30.8},5]
[{"$f":"'Student Profile'!A26","v":""},{"$f":"IF(('Student Profile'!C26)>0,'Student Profile'!C26,\"\")","v":""},29,15,44,29,15,74,29,15,74,29,15,74,29,15,74,29,15,74,29,15,74,134,{"$f":"IFERROR(X27/'Student Profile'!P26,\"\")","v":26.8},28]
[{"$f":"'Student Profile'!A27","v":""},{"$f":"IF(('Student Profile'!C27)>0,'Student Profile'!C27,\"\")","v":""},20,10,30,20,10,50,20,10,50,20,10,50,20,10,50,20,10,50,20,10,50,90,{"$f":"IFERROR(X28/'Student Profile'!P27,\"\")","v":18},42]
[{"$f":"'Student Profile'!A28","v":""},{"$f":"IF(('Student Profile'!C28)>0,'Student Profile'!C28,\"\")","v":""},25,15,40,25,15,67,25,15,67,25,15,67,25,15,67,25,15,67,25,15,67,130,{"$f":"IFERROR(X29/'Student Profile'!P28,\"\")","v":26},33]
[{"$f":"'Student Profile'!A29","v":""},{"$f":"IF(('Student Profile'!C29)>0,'Student Profile'!C29,\"\")","v":""},35,20,55,35,20,92,35,20,92,35,20,92,35,20,92,35,20,92,35,20,92,175,{"$f":"IFERROR(X30/'Student Profile'!P29,\"\")","v":35},1]
[{"$f":"'Student Profile'!A30","v":""},{"$f":"IF(('Student Profile'!C30)>0,'Student Profile'!C30,\"\")","v":""},25,17,42,25,17,70,25,17,70,25,17,70,25,17,70,25,17,70,25,17,70,144,{"$f":"IFERROR(X31/'Student Profile'!P30,\"\")","v":28.8},10]
[{"$f":"'Student Profile'!A31","v":""},{"$f":"IF(('Student Profile'!C31)>0,'Student Profile'!C31,\"\")","v":""},34,15,49,34,15,82,34,15,82,34,15,82,34,15,82,34,15,82,34,15,82,139,{"$f":"IFERROR(X32/'Student Profile'!P31,\"\")","v":27.8},19]
[{"$f":"'Student Profile'!A32","v":""},{"$f":"IF(('Student Profile'!C32)>0,'Student Profile'!C32,\"\")","v":""},36,15,51,36,15,85,36,15,85,36,15,85,36,15,85,36,15,85,36,15,85,141,{"$f":"IFERROR(X33/'Student Profile'!P32,\"\")","v":28.2},14]
[{"$f":"'Student Profile'!A33","v":""},{"$f":"IF(('Student Profile'!C33)>0,'Student Profile'!C33,\"\")","v":""},25,15,40,25,15,67,25,15,67,25,15,67,25,15,67,25,15,67,25,15,67,130,{"$f":"IFERROR(X34/'Student Profile'!P33,\"\")","v":26},33]
[{"$f":"'Student Profile'!A34","v":""},{"$f":"IF(('Student Profile'!C34)>0,'Student Profile'!C34,\"\")","v":""},34,15,49,34,15,82,34,15,82,34,15,82,34,15,82,34,15,82,34,15,82,139,{"$f":"IFERROR(X35/'Student Profile'!P34,\"\")","v":27.8},19]
[{"$f":"'Student Profile'!A35","v":""},{"$f":"IF(('Student Profile'!C35)>0,'Student Profile'!C35,\"\")","v":""},28,18,46,28,18,77,28,18,77,28,18,77,28,18,77,28,18,77,28,18,77,154,{"$f":"IFERROR(X36/'Student Profile'!P35,\"\")","v":30.8},5]
[{"$f":"'Student Profile'!A36","v":""},{"$f":"IF(('Student Profile'!C36)>0,'Student Profile'!C36,\"\")","v":""},29,15,44,29,15,74,29,15,74,29,15,74,29,15,74,29,15,74,29,15,74,134,{"$f":"IFERROR(X37/'Student Profile'!P36,\"\")","v":26.8},28]
[{"$f":"'Student Profile'!A37","v":""},{"$f":"IF(('Student Profile'!C37)>0,'Student Profile'!C37,\"\")","v":""},20,10,30,20,10,50,20,10,50,20,10,50,20,10,50,20,10,50,20,10,50,90,{"$f":"IFERROR(X38/'Student Profile'!P37,\"\")","v":18},42]
[{"$f":"'Student Profile'!A38","v":""},{"$f":"IF(('Student Profile'!C38)>0,'Student Profile'!C38,\"\")","v":""},25,15,40,25,15,67,25,15,67,25,15,67,25,15,67,25,15,67,25,15,67,130,{"$f":"IFERROR(X39/'Student Profile'!P38,\"\")","v":26},33]
[{"$f":"'Student Profile'!A39","v":""},{"$f":"IF(('Student Profile'!C39)>0,'Student Profile'!C39,\"\")","v":""},35,20,55,35,20,92,35,20,92,35,20,92,35,20,92,35,20,92,35,20,92,175,{"$f":"IFERROR(X40/'Student Profile'!P39,\"\")","v":35},1]
[{"$f":"'Student Profile'!A40","v":""},{"$f":"IF(('Student Profile'!C40)>0,'Student Profile'!C40,\"\")","v":""},25,17,42,25,17,70,25,17,70,25,17,70,25,17,70,25,17,70,25,17,70,144,{"$f":"IFERROR(X41/'Student Profile'!P40,\"\")","v":28.8},10]
[{"$f":"'Student Profile'!A41","v":""},{"$f":"IF(('Student Profile'!C41)>0,'Student Profile'!C41,\"\")","v":""},34,15,49,34,15,82,34,15,82,34,15,82,34,15,82,34,15,82,34,15,82,139,{"$f":"IFERROR(X42/'Student Profile'!P41,\"\")","v":27.8},19]
[{"$f":"'Student Profile'!A42","v":""},{"$f":"IF(('Student Profile'!C42)>0,'Student Profile'!C42,\"\")","v":""},36,15,51,36,15,85,36,15,85,36,15,85,36,15,85,36,15,85,36,15,85,141,{"$f":"IFERROR(X43/'Student Profile'!P42,\"\")","v":28.2},14]
[{"$f":"'Student Profile'!A43","v":""},{"$f":"IF(('Student Profile'!C43)>0,'Student Profile'!C43,\"\")","v":""},25,15,40,25,15,67,25,15,67,25,15,67,25,15,67,25,15,67,25,15,67,130,{"$f":"IFERROR(X44/'Student Profile'!P43,\"\")","v":26},33]
[{"$f":"'Student Profile'!A44","v":""},{"$f":"IF(('Student Profile'!C44)>0,'Student Profile'!C44,\"\")","v":""},34,15,49,34,15,82,34,15,82,34,15,82,34,15,82,34,15,82,34,15,82,139,{"$f":"IFERROR(X45/'Student Profile'!P44,\"\")","v":27.8},19]
[{"$f":"'Student Profile'!A45","v":""},{"$f":"IF(('Student Profile'!C45)>0,'Student Profile'!C45,\"\")","v":""},28,18,46,28,18,77,28,18,77,28,18,77,28,18,77,28,18,77,28,18,77,154,{"$f":"IFERROR(X46/'Student Profile'!P45,\"\")","v":30.8},5]
[{"$f":"'Student Profile'!A46","v":""},{"$f":"IF(('Student Profile'!C46)>0,'Student Profile'!C46,\"\")","v":""},29,15,44,29,15,74,29,15,74,29,15,74,29,15,74,29,15,74,29,15,74,134,{"$f":"IFERROR(X47/'Student Profile'!P46,\"\")","v":26.8},28]
[{"$f":"'Student Profile'!A47","v":""},{"$f":"IF(('Student Profile'!C47)>0,'Student Profile'!C47,\"\")","v":""},36,15,51,36,15,85,36,15,85,36,15,85,36,15,85,36,15,85,36,15,85,141,{"$f":"IFERROR(X48/'Student Profile'!P47,\"\")","v":28.2},14]
[{"$f":"'Student Profile'!A48","v":""},{"$f":"IF(('Student Profile'!C48)>0,'Student Profile'!C48,\"\")","v":""},25,15,40,25,15,67,25,15,67,25,15,67,25,15,67,25,15,67,25,15,67,130,{"$f":"IFERROR(X49/'Student Profile'!P48,\"\")","v":26},33]
[{"$f":"'Student Profile'!A49","v":""},{"$f":"IF(('Student Profile'!C49)>0,'Student Profile'!C49,\"\")","v":""},34,15,49,34,15,82,34,15,82,34,15,82,34,15,82,34,15,82,34,15,82,139,{"$f":"IFERROR(X50/'Student Profile'!P49,\"\")","v":27.8},19]
[{"$f":"'Student Profile'!A50","v":""},{"$f":"IF(('Student Profile'!C50)>0,'Student Profile'!C50,\"\")","v":""},28,18,46,28,18,77,28,18,77,28,18,77,28,18,77,28,18,77,28,18,77,154,{"$f":"IFERROR(X51/'Student Profile'!P50,\"\")","v":30.8},5]
[{"$f":"'Student Profile'!A51","v":""},{"$f":"IF(('Student Profile'!C51)>0,'Student Profile'!C51,\"\")","v":""},"AB",12,12,"AB",12,20,"AB",12,20,"AB",12,20,"AB",12,20,"AB",12,20,"AB",12,20,{"$f":"IF(OR(ISNUMBER(E52),ISNUMBER(H52),ISNUMBER(K52),ISNUMBER(N52),ISNUMBER(Q52),ISNUMBER(T52),ISNUMBER(W52)),SUM(E52,H52,K52,N52,Q52,T52,Q52),\"\")","v":132},{"$f":"IFERROR(X52/'Student Profile'!P51,\"\")","v":26.4},32]
["Subject Avg.",null,{"$f":"IF(AND(ISNUMBER(Z57),Z57>0),SUM(E8:E52)/C60,\"\")","v":44.044444444444444},null,null,{"$f":"IF(AND(ISNUMBER(Z58),Z58>0),SUM(H8:H52)/F60,\"\")","v":73.666666666666671},null,null,{"$f":"IF(AND(ISNUMBER(Z59),Z59>0),SUM(K8:K52)/I60,\"\")","v":73.666666666666671},null,null,{"$f":"IF(AND(ISNUMBER(Z60),Z60>0),SUM(N8:N52)/L60,\"\")","v":73.666666666666671},null,null,{"$f":"IF(AND(ISNUMBER(Z61),Z61>0),SUM(Q8:Q52)/O60,\"\")","v":73.666666666666671},null,null,{"$f":"IF(AND(ISNUMBER(Z62),Z62>0),SUM(T8:T52)/R60,\"\")","v":73.666666666666671},null,null,{"$f":"IF(AND(ISNUMBER(AO58),AO58>0),SUM(W8:W52)/U60,\"\")","v":""},null,null,"SUBJECTS","Total Student","Present"]
["Pass %age",null,{"$f":"IF(ISNUMBER(C53),(C61/C60)*100,\"0\")","v":88.888888888888886},null,null,{"$f":"IF(ISNUMBER(F53),F61/F60*100,\"0\")","v":97.777777777777771},null,null,{"$f":"IF(ISNUMBER(I53),I61/I60*100,\"0\")","v":97.777777777777771},null,null,{"$f":"IF(ISNUMBER(L53),L61/L60*100,\"0\")","v":97.777777777777771},null,null,{"$f":"IF(ISNUMBER(O53),O61/O60*100,\"0\")","v":97.777777777777771},null,null,{"$f":"IF(ISNUMBER(R53),R61/R60*100,\"0\")","v":97.777777777777771},null,null,{"$f":"IF(ISNUMBER(U53),U61/U60*100,\"0\")","v":"0"}]
["Below 33%",null,{"$f":"COUNTIF(E8:E52,\"<33\")","v":5},null,null,{"$f":"COUNTIF(H8:H52,\"<33\")","v":1},null,null,{"$f":"COUNTIF(K8:K52,\"<33\")","v":1},null,null,{"$f":"COUNTIF(N8:N52,\"<33\")","v":1},null,null,{"$f":"COUNTIF(Q8:Q52,\"<33\")","v":1},null,null,{"$f":"COUNTIF(T8:T52,\"<33\")","v":1},null,null,{"$f":"COUNTIF(V8:V52,\"<33\")","v":45}]
["33% to 50%",null,{"$f":"COUNTIF(E8:E52,\">=33\")-C57-C58-C59","v":31},null,null,{"$f":"COUNTIF(H8:H52,\">=33\")-F57-F58-F59","v":0},null,null,{"$f":"COUNTIF(K8:K52,\">=33\")-I57-I58-I59","v":0},null,null,{"$f":"COUNTIF(N8:N52,\">=33\")-L57-L58-L59","v":0},null,null,{"$f":"COUNTIF(Q8:Q52,\">=33\")-O57-O58-O59","v":0},null,null,{"$f":"COUNTIF(T8:T52,\">=33\")-R57-R58-R59","v":0},null,null,{"$f":"COUNTIF(W8:W52,\">=33\")-U57-U58-U59","v":0}]
["50% to 60%",null,{"$f":"COUNTIF(E8:E52,\">=50\")-C58-C59","v":9},null,null,{"$f":"COUNTIF(H8:H52,\">=50\")-F58-F59","v":4},null,null,{"$f":"COUNTIF(K8:K52,\">=50\")-I58-I59","v":4},null,null,{"$f":"COUNTIF(N8:N52,\">=50\")-L58-L59","v":4},null,null,{"$f":"COUNTIF(Q8:Q52,\">=50\")-O58-O59","v":4},null,null,{"$f":"COUNTIF(T8:T52,\">=50\")-R58-R59","v":4},null,null,{"$f":"COUNTIF(W8:W52,\">=50\")-U58-U59","v":4},null,null,{"$f":"Home!B15","v":"ENGLISH"},{"$f":"C62","v":45},{"$f":"C60","v":45}]
["60% to 75%",null,{"$f":"COUNTIF(E8:E52,\">=60\")-C59","v":0},null,null,{"$f":"COUNTIF(H8:H52,\">=60\")-F59","v":17},null,null,{"$f":"COUNTIF(K8:K52,\">=60\")-I59","v":17},null,null,{"$f":"COUNTIF(N8:N52,\">=60\")-L59","v":17},null,null,{"$f":"COUNTIF(Q8:Q52,\">=60\")-O59","v":17},null,null,{"$f":"COUNTIF(T8:T52,\">=60\")-R59","v":17},null,null,{"$f":"COUNTIF(W8:W52,\">=60\")-U59","v":17},null,null,{"$f":"Home!B16","v":"HINDI"},{"$f":"F62","v":45},{"$f":"F60","v":45}]
["above 75%",null,{"$f":"COUNTIF(E8:E52,\">=75\")","v":0},null,null,{"$f":"COUNTIF(H8:H52,\">=75\")","v":23},null,null,{"$f":"COUNTIF(K8:K52,\">=75\")","v":23},null,null,{"$f":"COUNTIF(N8:N52,\">=75\")","v":23},null,null,{"$f":"COUNTIF(Q8:Q52,\">=75\")","v":23},null,null,{"$f":"COUNTIF(T8:T52,\">=75\")","v":23},null,null,{"$f":"COUNTIF(W8:W52,\">=75\")","v":23},null,null,{"$f":"Home!B17","v":"INFO PRACT"},{"$f":"I62","v":45},{"$f":"I60","v":45}]
["Appeared",null,{"$f":"COUNTIF(E8:E52,\">=0\")","v":45},null,null,{"$f":"COUNTIF(H8:H52,\">=0\")","v":45},null,null,{"$f":"COUNTIF(K8:K52,\">=0\")","v":45},null,null,{"$f":"COUNTIF(N8:N52,\">=0\")","v":45},null,null,{"$f":"COUNTIF(Q8:Q52,\">=0\")","v":45},null,null,{"$f":"COUNTIF(T8:T52,\">=0\")","v":45},null,null,{"$f":"COUNTIF(W8:W52,\">=0\")","v":45},null,null,{"$f":"Home!B18","v":"MATH"},{"$f":"L62","v":45},{"$f":"L60","v":45}]
["Passed",null,{"$f":"COUNTIF(E8:E52,\">=33\")","v":40},null,null,{"$f":"COUNTIF(H8:H52,\">=33\")","v":44},null,null,{"$f":"COUNTIF(K8:K52,\">=33\")","v":44},null,null,{"$f":"COUNTIF(N8:N52,\">=33\")","v":44},null,null,{"$f":"COUNTIF(Q8:Q52,\">=33\")","v":44},null,null,{"$f":"COUNTIF(T8:T52,\">=33\")","v":44},null,null,{"$f":"COUNTIF(W8:W52,\">=33\")","v":44},null,null,{"$f":"Home!B19","v":"CHEM"},{"$f":"O62","v":45},{"$f":"O60","v":45}]
["Total",null,{"$f":"C60+C63","v":45},null,null,{"$f":"F60+F63","v":45},null,null,{"$f":"I60+I63","v":45},null,null,{"$f":"L60+L63","v":45},null,null,{"$f":"O60+O63","v":45},null,null,{"$f":"R60+R63","v":45},null,null,{"$f":"U60+U63","v":45},null,null,{"$f":"Home!B20","v":"PHYSICS"},{"$f":"R62","v":45},{"$f":"R60","v":45}]
["Absent",null,{"$f":"COUNTIF(E8:E52,\"AB\")","v":0},null,null,{"$f":"COUNTIF(H8:H52,\"AB\")","v":0},null,null,{"$f":"COUNTIF(J8:J52,\"AB\")","v":0},null,null,{"$f":"COUNTIF(N8:N52,\"AB\")","v":0},null,null,{"$f":"COUNTIF(Q8:Q52,\"AB\")","v":0},null,null,{"$f":"COUNTIF(T8:T52,\"AB\")","v":0},null,null,{"$f":"COUNTIF(W8:W52,\"AB\")","v":0},null,null,{"$f":"Home!B21","v":"BIO"},{"$f":"U62","v":45},{"$f":"U60","v":45}]

{"sheet":"CONSOL.","index":10,"n_rows":50,"n_cols":104,"rows_kept":50,"cut":false,"hidden":false,"merged":[[1,102,1,103],[1,78,1,80],[1,81,1,85],[1,86,1,90],[1,94,1,96],[1,99,1,101],[0,16,0,28],[0,29,0,41],[1,34,1,38],[1,39,1,41],[1,42,1,46],[0,42,0,54],[1,47,1,51],[1,52,1,54],[1,0,1,1],[1,3,1,7],[1,8,1,12],[1,13,1,15],[0,0,0,2],[0,3,0,15],[4,37,4,38],[4,39,4,40],[1,16,1,20],[1,21,1,25],[1,26,1,28],[1,29,1,33],[2,29,3,41],[2,42,3,54],[4,76,4,77],[4,50,4,51],[4,52,4,53],[4,63,4,64],[4,65,4,66],[2,55,3,67],[2,0,4,0],[2,1,4,1],[2,2,4,2],[4,24,4,25],[4,26,4,27],[2,3,3,15],[2,16,3,28],[4,11,4,12],[4,13,4,14],[0,55,0,67],[0,68,0,80],[0,81,0,93],[0,94,0,103],[4,78,4,79],[4,89,4,90],[4,91,4,92],[2,68,3,80],[2,81,3,93],[1,55,1,59],[1,60,1,64],[1,65,1,67],[1,91,1,93],[2,94,3,103],[1,68,1,72],[1,73,1,77]]}
["SUBJECT WISE",null,null,{"$f":"CONCATENATE(Home!C$7,Home!I$7)","v":"JAWAHAR NAVODAYA VIDYALAYA, MOHINDERGARH"},null,null,null,null,null,null,null,null,null,null,null,null,{"$f":"D1","v":"JAWAHAR NAVODAYA VIDYALAYA, MOHINDERGARH"},null,null,null,null,null,null,null,null,null,null,null,null,{"$f":"Q1","v":"JAWAHAR NAVODAYA VIDYALAYA, MOHINDERGARH"},null,null,null,null,null,null,null,null,null,null,null,null,{"$f":"AD1","v":"JAWAHAR NAVODAYA VIDYALAYA, MOHINDERGARH"},null,null,null,null,null,null,null,null,null,null,null,null,{"$f":"AQ1","v":"JAWAHAR NAVODAYA VIDYALAYA, MOHINDERGARH"},null,null,null,null,null,null,null,null,null,null,null,null,{"$f":"BD1","v":"JAWAHAR NAVODAYA VIDYALAYA, MOHINDERGARH"},null,null,null,null,null,null,null,null,null,null,null,null,{"$f":"BQ1","v":"JAWAHAR NAVODAYA VIDYALAYA, MOHINDERGARH"},null,null,null,null,null,null,null,null,null,null,null,null,"JAWAHAR NAVODAYA VIDYALAYA, MOHINDERGARH"]
["Class",null,{"$f":"Home!$C$9","v":"XII A"},"Consolidate",null,null,null,null,{"$f":"Home!$B$8","v":"SESSION"},null,null,null,null,{"$f":"Home!$C$8","v":"2019-20"},null,null,"Consolidate",null,null,null,null,{"$f":"Home!$B$8","v":"SESSION"},null,null,null,null,{"$f":"Home!$C$8","v":"2019-20"},null,null,"Consolidate",null,null,null,null,{"$f":"Home!$B$8","v":"SESSION"},null,null,null,null,{"$f":"Home!$C$8","v":"2019-20"},null,null,"Consolidate",null,null,null,null,{"$f":"Home!$B$8","v":"SESSION"},null,null,null,null,{"$f":"Home!$C$8","v":"2019-20"},null,null,"Consolidate",null,null,null,null,{"$f":"Home!$B$8","v":"SESSION"},null,null,null,null,{"$f":"Home!$C$8","v":"2019-20"},null,null,"Consolidate",null,null,null,null,{"$f":"Home!$B$8","v":"SESSION"},null,null,null,null,{"$f":"Home!$C$8","v":"2019-20"},null,null,"Consolidate",null,null,null,null,{"$f":"Home!$B$8","v":"SESSION"},null,null,null,null,{"$f":"Home!$C$8","v":"2019-20"},null,null,"CLASS",null,null,{"$f":"Home!C9","v":"XII A"},null,{"$f":"Home!B8","v":"SESSION"},null,null,{"$f":"Home!C8","v":"2019-20"}]
["SR.\nNO.","NAME OF \nSTUDENT","ADM.NO.",{"$f":"Home!B15","v":"ENGLISH"},null,null,null,null,null,null,null,null,null,null,null,null,{"$f":"Home!B16","v":"HINDI"},null,null,null,null,null,null,null,null,null,null,null,null,{"$f":"Home!B17","v":"INFO PRACT"},null,null,null,null,null,null,null,null,null,null,null,null,{"$f":"Home!B18","v":"MATH"},null,null,null,null,null,null,null,null,null,null,null,null,{"$f":"Home!B19","v":"CHEM"},null,null,null,null,null,null,null,null,null,null,null,null,{"$f":"Home!B20","v":"PHYSICS"},null,null,null,null,null,null,null,null,null,null,null,null,{"$f":"Home!B21","v":"BIO"},null,null,null,null,null,null,null,null,null,null,null,null,"Overall Result (ALL SUBJECT)"]
[]
[null,null,null,"UT 1","UT 2","UT 3","T1","UT 4","UT 5/ \nPB 1","P.A; / PB2","T2","UT BEST \n1,2,3",null,"UT BEST \n4,5,6",null,"Total\n%","UT 1","UT 2","UT 3","T1","UT 4","UT 5/ \nPB 1","P.A; / PB2","T2","UT BEST \n1,2,3",null,"UT BEST \n4,5,6",null,"Total\n%","UT 1","UT 2","UT 3","T1","UT 4","UT 5/ \nPB 1","P.A; / PB2","T2","UT BEST \n1,2,3",null,"UT BEST \n4,5,6",null,"Total\n%","UT 1","UT 2","UT 3","T1","UT 4","UT 5/ \nPB 1","P.A; / PB2","T2","UT BEST \n1,2,3",null,"UT BEST \n4,5,6",null,"Total\n%","UT 1","UT 2","UT 3","T1","UT 4","UT 5/ \nPB 1","P.A; / PB2","T2","UT BEST \n1,2,3",null,"UT BEST \n4,5,6",null,"Total\n%","UT 1","UT 2","UT 3","T1","UT 4","UT 5/ \nPB 1","P.A; / PB2","T2","UT BEST \n1,2,3",null,"UT BEST \n4,5,6",null,"Total\n%","UT 1","UT 2","UT 3","T1","UT 4","UT 5/ \nPB 1","P.A; / PB2","T2","UT BEST \n1,2,3",null,"UT BEST \n4,5,6",null,"Total\n%",{"$f":"Home!B15","v":"ENGLISH"},{"$f":"Home!B16","v":"HINDI"},{"$f":"Home!B17","v":"INFO PRACT"},{"$f":"Home!B18","v":"MATH"},{"$f":"Home!B19","v":"CHEM"},{"$f":"Home!B20","v":"PHYSICS"},{"$f":"Home!B21","v":"BIO"},"Total","%age","Rank"]
[{"$f":"ANNUAL!A8","v":1},{"$f":"ANNUAL!B8","v":"SUNIL KUMAR"},{"$f":"IF('Student Profile'!D7>0,'Student Profile'!D7,\"\")","v":""},{"$f":"IF(ISNUMBER('UT1'!E8),'UT1'!E8,\"\")","v":50},{"$f":"IF(ISNUMBER('UT 2'!E8),'UT 2'!E8,\"\")","v":50},{"$f":"IF(ISNUMBER('UT 3 '!E8),'UT 3 '!E8,\"\")","v":50},{"$f":"IF('TT 1'!E8>0,'TT 1'!E8,\"\")","v":34},{"$f":"IF('UT 4'!E8>0,'UT 4'!E8,\"\")","v":50},{"$f":"IF('UT 5PB1'!E8>0,'UT 5PB1'!E8,\"\")","v":50},{"$f":"IF('PREANNU PB2 '!E8>0,'PREANNU PB2 '!E8,\"\")","v":50},{"$f":"IF(ANNUAL!E8>0,ANNUAL!E8,\"\")","v":30},{"$f":"IF(OR(ISNUMBER(D6),ISNUMBER(E6),ISNUMBER(F6)),LARGE(D6:F6,1)/10,\"\")","v":5},{"$f":"IF(OR(ISNUMBER(D6),ISNUMBER(E6),ISNUMBER(F6)),LARGE(D6:F6,2)/10,\"\")","v":5},{"$f":"IF(OR(ISNUMBER(H6),ISNUMBER(I6),ISNUMBER(J6)),LARGE(H6:J6,1)/10,\"\")","v":5},{"$f":"IF(OR(ISNUMBER(H6),ISNUMBER(I6),ISNUMBER(J6)),LARGE(H6:J6,2)/10,\"\")","v":5},{"$f":"IF(OR(ISNUMBER(L6),ISNUMBER(M6),ISNUMBER(N6),ISNUMBER(O6),ISNUMBER(G6),ISNUMBER(K6)),SUM(L6,M6,N6,O6,('TT 1'!D7*0.3),(ANNUAL!D7*0.3)),\"\")","v":35},{"$f":"IF(ISNUMBER('UT1'!H8),'UT1'!H8,\"\")","v":80},{"$f":"IF(ISNUMBER('UT 2'!H8),'UT 2'!H8,\"\")","v":50},{"$f":"IF(ISNUMBER('UT 3 '!H8),'UT 3 '!H8,\"\")","v":50},{"$f":"IF('TT 1'!H8>0,'TT 1'!H8,\"\")","v":50},{"$f":"IF('UT 4'!H8>0,'UT 4'!H8,\"\")","v":50},{"$f":"IF('UT 5PB1'!H8>0,'UT 5PB1'!H8,\"\")","v":50},{"$f":"IF('PREANNU PB2 '!H8>0,'PREANNU PB2 '!H8,\"\")","v":50},{"$f":"IF(ANNUAL!H8>0,ANNUAL!H8,\"\")","v":50},{"$f":"IF(OR(ISNUMBER(Q6),ISNUMBER(R6),ISNUMBER(S6)),LARGE(Q6:S6,1)/10,\"\")","v":8},{"$f":"IF(OR(ISNUMBER(Q6),ISNUMBER(R6),ISNUMBER(S6)),LARGE(Q6:S6,2)/10,\"\")","v":5},{"$f":"IF(OR(ISNUMBER(U6),ISNUMBER(V6),ISNUMBER(W6)),LARGE(U6:W6,1)/10,\"\")","v":5},{"$f":"IF(OR(ISNUMBER(U6),ISNUMBER(V6),ISNUMBER(W6)),LARGE(U6:W6,2)/10,\"\")","v":5},{"$f":"IF(OR(ISNUMBER(Y6),ISNUMBER(Z6),ISNUMBER(AA6),ISNUMBER(AB6),ISNUMBER(T6),ISNUMBER(X6)),SUM(Y6,Z6,AA6,AB6,('TT 1'!E7*0.3),(ANNUAL!E7*0.3)),\"\")","v":83},{"$f":"IF(ISNUMBER('UT1'!K8),'UT1'!K8,\"\")","v":50},{"$f":"IF(ISNUMBER('UT 2'!K8),'UT 2'!K8,\"\")","v":50},{"$f":"IF(ISNUMBER('UT 3 '!K8),'UT 3 '!K8,\"\")","v":50},{"$f":"IF('TT 1'!K8>0,'TT 1'!K8,\"\")","v":50},{"$f":"IF('UT 4'!K8>0,'UT 4'!K8,\"\")","v":50},{"$f":"IF('UT 5PB1'!K8>0,'UT 5PB1'!K8,\"\")","v":50},{"$f":"IF('PREANNU PB2 '!K8>0,'PREANNU PB2 '!K8,\"\")","v":50},{"$f":"IF(ANNUAL!K8>0,ANNUAL!K8,\"\")","v":50},{"$f":"IF(OR(ISNUMBER(AD6),ISNUMBER(AE6),ISNUMBER(AF6)),LARGE(AD6:AF6,1)/10,\"\")","v":5},{"$f":"IF(OR(ISNUMBER(AD6),ISNUMBER(AE6),ISNUMBER(AF6)),LARGE(AD6:AF6,2)/10,\"\")","v":5},{"$f":"IF(OR(ISNUMBER(AH6),ISNUMBER(AI6),ISNUMBER(AJ6)),LARGE(AH6:AJ6,1)/10,\"\")","v":5},{"$f":"IF(OR(ISNUMBER(AH6),ISNUMBER(AI6),ISNUMBER(AJ6)),LARGE(AH6:AJ6,2)/10,\"\")","v":5},{"$f":"IF(OR(ISNUMBER(AL6),ISNUMBER(AM6),ISNUMBER(AN6),ISNUMBER(AO6),ISNUMBER(AG6),ISNUMBER(AK6)),SUM(AL6,AM6,AN6,AO6,('TT 1'!R7*0.3),(ANNUAL!R7*0.3)),\"\")","v":44},{"$f":"IF(ISNUMBER('UT1'!N8),'UT1'!N8,\"\")","v":50},{"$f":"IF(ISNUMBER('UT 2'!N8),'UT 2'!N8,\"\")","v":50},{"$f":"IF(ISNUMBER('UT 3 '!N8),'UT 3 '!N8,\"\")","v":50},{"$f":"IF('TT 1'!N8>0,'TT 1'!N8,\"\")","v":50},{"$f":"IF('UT 4'!N8>0,'UT 4'!N8,\"\")","v":50},{"$f":"IF('UT 5PB1'!N8>0,'UT 5PB1'!N8,\"\")","v":50},{"$f":"IF('PREANNU PB2 '!N8>0,'PREANNU PB2 '!N8,\"\")","v":50},{"$f":"IF(ANNUAL!N8>0,ANNUAL!N8,\"\")","v":50},{"$f":"IF(OR(ISNUMBER(AQ6),ISNUMBER(AR6),ISNUMBER(AS6)),LARGE(AQ6:AS6,1)/10,\"\")","v":5},{"$f":"IF(OR(ISNUMBER(AQ6),ISNUMBER(AR6),ISNUMBER(AS6)),LARGE(AQ6:AS6,2)/10,\"\")","v":5},{"$f":"IF(OR(ISNUMBER(AU6),ISNUMBER(AV6),ISNUMBER(AW6)),LARGE(AU6:AW6,1)/10,\"\")","v":5},{"$f":"IF(OR(ISNUMBER(AU6),ISNUMBER(AV6),ISNUMBER(AW6)),LARGE(AU6:AW6,2)/10,\"\")","v":5},{"$f":"IF(OR(ISNUMBER(AY6),ISNUMBER(AZ6),ISNUMBER(BA6),ISNUMBER(BB6),ISNUMBER(AT6),ISNUMBER(AX6)),SUM(AY6,AZ6,BA6,BB6,('TT 1'!AE7*0.3),(ANNUAL!AE7*0.3)),\"\")","v":20},{"$f":"IF(ISNUMBER('UT1'!Q8),'UT1'!Q8,\"\")","v":50},{"$f":"IF(ISNUMBER('UT 2'!Q8),'UT 2'!Q8,\"\")","v":50},{"$f":"IF(ISNUMBER('UT 3 '!Q8),'UT 3 '!Q8,\"\")","v":50},{"$f":"IF('TT 1'!Q8>0,'TT 1'!Q8,\"\")","v":50},{"$f":"IF('UT 4'!Q8>0,'UT 4'!Q8,\"\")","v":50},{"$f":"IF('UT 5PB1'!Q8>0,'UT 5PB1'!Q8,\"\")","v":50},{"$f":"IF('PREANNU PB2 '!Q8>0,'PREANNU PB2 '!Q8,\"\")","v":50},{"$f":"IF(ANNUAL!Q8>0,ANNUAL!Q8,\"\")","v":50},{"$f":"IF(OR(ISNUMBER(BD6),ISNUMBER(BE6),ISNUMBER(BF6)),LARGE(BD6:BF6,1)/10,\"\")","v":5},{"$f":"IF(OR(ISNUMBER(BD6),ISNUMBER(BE6),ISNUMBER(BF6)),LARGE(BD6:BF6,2)/10,\"\")","v":5},{"$f":"IF(OR(ISNUMBER(BH6),ISNUMBER(BI6),ISNUMBER(BJ6)),LARGE(BH6:BJ6,1)/10,\"\")","v":5},{"$f":"IF(OR(ISNUMBER(BH6),ISNUMBER(BI6),ISNUMBER(BJ6)),LARGE(BH6:BJ6,2)/10,\"\")","v":5},{"$f":"IF(OR(ISNUMBER(BL6),ISNUMBER(BM6),ISNUMBER(BN6),ISNUMBER(BO6),ISNUMBER(BG6),ISNUMBER(BK6)),SUM(BL6,BM6,BN6,BO6,('TT 1'!AR7*0.3),(ANNUAL!AR7*0.3)),\"\")","v":20},{"$f":"IF(ISNUMBER('UT1'!T8),'UT1'!T8,\"\")","v":50},{"$f":"IF(ISNUMBER('UT 2'!T8),'UT 2'!T8,\"\")","v":50},{"$f":"IF(ISNUMBER('UT 3 '!T8),'UT 3 '!T8,\"\")","v":50},{"$f":"IF('TT 1'!T8>0,'TT 1'!T8,\"\")","v":50},{"$f":"IF('UT 4'!T8>0,'UT 4'!T8,\"\")","v":50},{"$f":"IF('UT 5PB1'!T8>0,'UT 5PB1'!T8,\"\")","v":50},{"$f":"IF('PREANNU PB2 '!T8>0,'PREANNU PB2 '!T8,\"\")","v":50},{"$f":"IF(ANNUAL!T8>0,ANNUAL!T8,\"\")","v":50},{"$f":"IF(OR(ISNUMBER(BQ6),ISNUMBER(BR6),ISNUMBER(BS6)),LARGE(BQ6:BS6,1)/10,\"\")","v":5},{"$f":"IF(OR(ISNUMBER(BQ6),ISNUMBER(BR6),ISNUMBER(BS6)),LARGE(BQ6:BS6,2)/10,\"\")","v":5},{"$f":"IF(OR(ISNUMBER(BU6),ISNUMBER(BV6),ISNUMBER(BW6)),LARGE(BU6:BW6,1)/10,\"\")","v":5},{"$f":"IF(OR(ISNUMBER(BU6),ISNUMBER(BV6),ISNUMBER(BW6)),LARGE(BU6:BW6,2)/10,\"\")","v":5},{"$f":"IF(OR(ISNUMBER(BY6),ISNUMBER(BZ6),ISNUMBER(CA6),ISNUMBER(CB6),ISNUMBER(BT6),ISNUMBER(BX6)),SUM(BY6,BZ6,CA6,CB6,('TT 1'!BE7*0.3),(ANNUAL!BE7*0.3)),\"\")","v":20},{"$f":"IF(ISNUMBER('UT1'!W8),'UT1'!W8,\"\")","v":50},{"$f":"IF(ISNUMBER('UT 2'!W8),'UT 2'!W8,\"\")","v":50},{"$f":"IF(ISNUMBER('UT 3 '!W8),'UT 3 '!W8,\"\")","v":50},{"$f":"IF('TT 1'!W8>0,'TT 1'!W8,\"\")","v":50},{"$f":"IF('UT 4'!W8>0,'UT 4'!W8,\"\")","v":50},{"$f":"IF('UT 5PB1'!W8>0,'UT 5PB1'!W8,\"\")","v":50},{"$f":"IF('PREANNU PB2 '!W8>0,'PREANNU PB2 '!W8,\"\")","v":50},{"$f":"IF(ANNUAL!W8>0,ANNUAL!W8,\"\")","v":50},{"$f":"IF(OR(ISNUMBER(CD6),ISNUMBER(CE6),ISNUMBER(CF6)),LARGE(CD6:CF6,1)/10,\"\")","v":5},{"$f":"IF(OR(ISNUMBER(CD6),ISNUMBER(CE6),ISNUMBER(CF6)),LARGE(CD6:CF6,2)/10,\"\")","v":5},{"$f":"IF(OR(ISNUMBER(CH6),ISNUMBER(CI6),ISNUMBER(CJ6)),LARGE(CH6:CJ6,1)/10,\"\")","v":5},{"$f":"IF(OR(ISNUMBER(CH6),ISNUMBER(CI6),ISNUMBER(CJ6)),LARGE(CH6:CJ6,2)/10,\"\")","v":5},{"$f":"IF(OR(ISNUMBER(CL6),ISNUMBER(CM6),ISNUMBER(CN6),ISNUMBER(CO6),ISNUMBER(CG6),ISNUMBER(CK6)),SUM(CL6,CM6,CN6,CO6,('TT 1'!BR7*0.3),(ANNUAL!BR7*0.3)),\"\")","v":20},{"$f":"IF(ISNUMBER(P6),P6,\"\")","v":35},{"$f":"IF(ISNUMBER(AC6),AC6,\"\")","v":83},{"$f":"IF(ISNUMBER(AP6),AP6,\"\")","v":44},{"$f":"IF(ISNUMBER(BC6),BC6,\"\")","v":20},{"$f":"IF(ISNUMBER(BP6),BP6,\"\")","v":20},{"$f":"IF(ISNUMBER(CC6),CC6,\"\")","v":20},{"$f":"IF(ISNUMBER(CP6),CP6,\"\")","v":20},{"$f":"SUM(CQ6:CW6)","v":242},{"$f":"CX6/'Student Profile'!P7","v":48.4},{"$f":"IF(ISNUMBER(CX6),RANK(CX6,CX$6:CX$50,0),\"\")","v":37}]
[{"$f":"ANNUAL!A9","v":""},{"$f":"ANNUAL!B9","v":""},{"$f":"IF('Student Profile'!D8>0,'Student Profile'!D8,\"\")","v":""},{"$f":"IF(ISNUMBER('UT1'!E9),'UT1'!E9,\"\")","v":67},{"$f":"IF(ISNUMBER('UT 2'!E9),'UT 2'!E9,\"\")","v":67},{"$f":"IF(ISNUMBER('UT 3 '!E9),'UT 3 '!E9,\"\")","v":67},{"$f":"IF('TT 1'!E9>0,'TT 1'!E9,\"\")","v":45},{"$f":"IF('UT 4'!E9>0,'UT 4'!E9,\"\")","v":67},{"$f":"IF('UT 5PB1'!E9>0,'UT 5PB1'!E9,\"\")","v":67},{"$f":"IF('PREANNU PB2 '!E9>0,'PREANNU PB2 '!E9,\"\")","v":67},{"$f":"IF(ANNUAL!E9>0,ANNUAL!E9,\"\")","v":40},{"$f":"IF(OR(ISNUMBER(D7),ISNUMBER(E7),ISNUMBER(F7)),LARGE(D7:F7,1)/10,\"\")","v":6.7},{"$f":"IF(OR(ISNUMBER(D7),ISNUMBER(E7),ISNUMBER(F7)),LARGE(D7:F7,2)/10,\"\")","v":6.7},{"$f":"IF(OR(ISNUMBER(H7),ISNUMBER(I7),ISNUMBER(J7)),LARGE(H7:J7,1)/10,\"\")","v":6.7},{"$f":"IF(OR(ISNUMBER(H7),ISNUMBER(I7),ISNUMBER(J7)),LARGE(H7:J7,2)/10,\"\")","v":6.7},{"$f":"IF(OR(ISNUMBER(L7),ISNUMBER(M7),ISNUMBER(N7),ISNUMBER(O7),ISNUMBER(G7),ISNUMBER(K7)),SUM(L7,M7,N7,O7,('TT 1'!D8*0.3),(ANNUAL!D8*0.3)),\"\")","v":32.799999999999997},{"$f":"IF(ISNUMBER('UT1'!H9),'UT1'!H9,\"\")","v":40},{"$f":"IF(ISNUMBER('UT 2'!H9),'UT 2'!H9,\"\")","v":67},{"$f":"IF(ISNUMBER('UT 3 '!H9),'UT 3 '!H9,\"\")","v":67},{"$f":"IF('TT 1'!H9>0,'TT 1'!H9,\"\")","v":67},{"$f":"IF('UT 4'!H9>0,'UT 4'!H9,\"\")","v":67},{"$f":"IF('UT 5PB1'!H9>0,'UT 5PB1'!H9,\"\")","v":67},{"$f":"IF('PREANNU PB2 '!H9>0,'PREANNU PB2 '!H9,\"\")","v":67},{"$f":"IF(ANNUAL!H9>0,ANNUAL!H9,\"\")","v":67},{"$f":"IF(OR(ISNUMBER(Q7),ISNUMBER(R7),ISNUMBER(S7)),LARGE(Q7:S7,1)/10,\"\")","v":6.7},{"$f":"IF(OR(ISNUMBER(Q7),ISNUMBER(R7),ISNUMBER(S7)),LARGE(Q7:S7,2)/10,\"\")","v":6.7},{"$f":"IF(OR(ISNUMBER(U7),ISNUMBER(V7),ISNUMBER(W7)),LARGE(U7:W7,1)/10,\"\")","v":6.7},{"$f":"IF(OR(ISNUMBER(U7),ISNUMBER(V7),ISNUMBER(W7)),LARGE(U7:W7,2)/10,\"\")","v":6.7},{"$f":"IF(OR(ISNUMBER(Y7),ISNUMBER(Z7),ISNUMBER(AA7),ISNUMBER(AB7),ISNUMBER(T7),ISNUMBER(X7)),SUM(Y7,Z7,AA7,AB7,('TT 1'!E8*0.3),(ANNUAL!E8*0.3)),\"\")","v":46},{"$f":"IF(ISNUMBER('UT1'!K9),'UT1'!K9,\"\")","v":67},{"$f":"IF(ISNUMBER('UT 2'!K9),'UT 2'!K9,\"\")","v":67},{"$f":"IF(ISNUMBER('UT 3 '!K9),'UT 3 '!K9,\"\")","v":67},{"$f":"IF('TT 1'!K9>0,'TT 1'!K9,\"\")","v":67},{"$f":"IF('UT 4'!K9>0,'UT 4'!K9,\"\")","v":67},{"$f":"IF('UT 5PB1'!K9>0,'UT 5PB1'!K9,\"\")","v":67},{"$f":"IF('PREANNU PB2 '!K9>0,'PREANNU PB2 '!K9,\"\")","v":67},{"$f":"IF(ANNUAL!K9>0,ANNUAL!K9,\"\")","v":67},{"$f":"IF(OR(ISNUMBER(AD7),ISNUMBER(AE7),ISNUMBER(AF7)),LARGE(AD7:AF7,1)/10,\"\")","v":6.7},{"$f":"IF(OR(ISNUMBER(AD7),ISNUMBER(AE7),ISNUMBER(AF7)),LARGE(AD7:AF7,2)/10,\"\")","v":6.7},{"$f":"IF(OR(ISNUMBER(AH7),ISNUMBER(AI7),ISNUMBER(AJ7)),LARGE(AH7:AJ7,1)/10,\"\")","v":6.7},{"$f":"IF(OR(ISNUMBER(AH7),ISNUMBER(AI7),ISNUMBER(AJ7)),LARGE(AH7:AJ7,2)/10,\"\")","v":6.7},{"$f":"IF(OR(ISNUMBER(AL7),ISNUMBER(AM7),ISNUMBER(AN7),ISNUMBER(AO7),ISNUMBER(AG7),ISNUMBER(AK7)),SUM(AL7,AM7,AN7,AO7,('TT 1'!R8*0.3),(ANNUAL!R8*0.3)),\"\")","v":38.799999999999997},{"$f":"IF(ISNUMBER('UT1'!N9),'UT1'!N9,\"\")","v":67},{"$f":"IF(ISNUMBER('UT 2'!N9),'UT 2'!N9,\"\")","v":67},{"$f":"IF(ISNUMBER('UT 3 '!N9),'UT 3 '!N9,\"\")","v":67},{"$f":"IF('TT 1'!N9>0,'TT 1'!N9,\"\")","v":67},{"$f":"IF('UT 4'!N9>0,'UT 4'!N9,\"\")","v":67},{"$f":"IF('UT 5PB1'!N9>0,'UT 5PB1'!N9,\"\")","v":67},{"$f":"IF('PREANNU PB2 '!N9>0,'PREANNU PB2 '!N9,\"\")","v":67},{"$f":"IF(ANNUAL!N9>0,ANNUAL!N9,\"\")","v":67},{"$f":"IF(OR(ISNUMBER(AQ7),ISNUMBER(AR7),ISNUMBER(AS7)),LARGE(AQ7:AS7,1)/10,\"\")","v":6.7},{"$f":"IF(OR(ISNUMBER(AQ7),ISNUMBER(AR7),ISNUMBER(AS7)),LARGE(AQ7:AS7,2)/10,\"\")","v":6.7},{"$f":"IF(OR(ISNUMBER(AU7),ISNUMBER(AV7),ISNUMBER(AW7)),LARGE(AU7:AW7,1)/10,\"\")","v":6.7},{"$f":"IF(OR(ISNUMBER(AU7),ISNUMBER(AV7),ISNUMBER(AW7)),LARGE(AU7:AW7,2)/10,\"\")","v":6.7},{"$f":"IF(OR(ISNUMBER(AY7),ISNUMBER(AZ7),ISNUMBER(BA7),ISNUMBER(BB7),ISNUMBER(AT7),ISNUMBER(AX7)),SUM(AY7,AZ7,BA7,BB7,('TT 1'!AE8*0.3),(ANNUAL!AE8*0.3)),\"\")","v":26.8},{"$f":"IF(ISNUMBER('UT1'!Q9),'UT1'!Q9,\"\")","v":67},{"$f":"IF(ISNUMBER('UT 2'!Q9),'UT 2'!Q9,\"\")","v":67},{"$f":"IF(ISNUMBER('UT 3 '!Q9),'UT 3 '!Q9,\"\")","v":67},{"$f":"IF('TT 1'!Q9>0,'TT 1'!Q9,\"\")","v":67},{"$f":"IF('UT 4'!Q9>0,'UT 4'!Q9,\"\")","v":67},{"$f":"IF('UT 5PB1'!Q9>0,'UT 5PB1'!Q9,\"\")","v":67},{"$f":"IF('PREANNU PB2 '!Q9>0,'PREANNU PB2 '!Q9,\"\")","v":67},{"$f":"IF(ANNUAL!Q9>0,ANNUAL!Q9,\"\")","v":67},{"$f":"IF(OR(ISNUMBER(BD7),ISNUMBER(BE7),ISNUMBER(BF7)),LARGE(BD7:BF7,1)/10,\"\")","v":6.7},{"$f":"IF(OR(ISNUMBER(BD7),ISNUMBER(BE7),ISNUMBER(BF7)),LARGE(BD7:BF7,2)/10,\"\")","v":6.7},{"$f":"IF(OR(ISNUMBER(BH7),ISNUMBER(BI7),ISNUMBER(BJ7)),LARGE(BH7:BJ7,1)/10,\"\")","v":6.7},{"$f":"IF(OR(ISNUMBER(BH7),ISNUMBER(BI7),ISNUMBER(BJ7)),LARGE(BH7:BJ7,2)/10,\"\")","v":6.7},{"$f":"IF(OR(ISNUMBER(BL7),ISNUMBER(BM7),ISNUMBER(BN7),ISNUMBER(BO7),ISNUMBER(BG7),ISNUMBER(BK7)),SUM(BL7,BM7,BN7,BO7,('TT 1'!AR8*0.3),(ANNUAL!AR8*0.3)),\"\")","v":26.8},{"$f":"IF(ISNUMBER('UT1'!T9),'UT1'!T9,\"\")","v":67},{"$f":"IF(ISNUMBER('UT 2'!T9),'UT 2'!T9,\"\")","v":67},{"$f":"IF(ISNUMBER('UT 3 '!T9),'UT 3 '!T9,\"\")","v":67},{"$f":"IF('TT 1'!T9>0,'TT 1'!T9,\"\")","v":67},{"$f":"IF('UT 4'!T9>0,'UT 4'!T9,\"\")","v":67},{"$f":"IF('UT 5PB1'!T9>0,'UT 5PB1'!T9,\"\")","v":67},{"$f":"IF('PREANNU PB2 '!T9>0,'PREANNU PB2 '!T9,\"\")","v":67},{"$f":"IF(ANNUAL!T9>0,ANNUAL!T9,\"\")","v":67},{"$f":"IF(OR(ISNUMBER(BQ7),ISNUMBER(BR7),ISNUMBER(BS7)),LARGE(BQ7:BS7,1)/10,\"\")","v":6.7},{"$f":"IF(OR(ISNUMBER(BQ7),ISNUMBER(BR7),ISNUMBER(BS7)),LARGE(BQ7:BS7,2)/10,\"\")","v":6.7},{"$f":"IF(OR(ISNUMBER(BU7),ISNUMBER(BV7),ISNUMBER(BW7)),LARGE(BU7:BW7,1)/10,\"\")","v":6.7},{"$f":"IF(OR(ISNUMBER(BU7),ISNUMBER(BV7),ISNUMBER(BW7)),LARGE(BU7:BW7,2)/10,\"\")","v":6.7},{"$f":"IF(OR(ISNUMBER(BY7),ISNUMBER(BZ7),ISNUMBER(CA7),ISNUMBER(CB7),ISNUMBER(BT7),ISNUMBER(BX7)),SUM(BY7,BZ7,CA7,CB7,('TT 1'!BE8*0.3),(ANNUAL!BE8*0.3)),\"\")","v":26.8},{"$f":"IF(ISNUMBER('UT1'!W9),'UT1'!W9,\"\")","v":67},{"$f":"IF(ISNUMBER('UT 2'!W9),'UT 2'!W9,\"\")","v":67},{"$f":"IF(ISNUMBER('UT 3 '!W9),'UT 3 '!W9,\"\")","v":67},{"$f":"IF('TT 1'!W9>0,'TT 1'!W9,\"\")","v":67},{"$f":"IF('UT 4'!W9>0,'UT 4'!W9,\"\")","v":67},{"$f":"IF('UT 5PB1'!W9>0,'UT 5PB1'!W9,\"\")","v":67},{"$f":"IF('PREANNU PB2 '!W9>0,'PREANNU PB2 '!W9,\"\")","v":67},{"$f":"IF(ANNUAL!W9>0,ANNUAL!W9,\"\")","v":67},{"$f":"IF(OR(ISNUMBER(CD7),ISNUMBER(CE7),ISNUMBER(CF7)),LARGE(CD7:CF7,1)/10,\"\")","v":6.7},{"$f":"IF(OR(ISNUMBER(CD7),ISNUMBER(CE7),ISNUMBER(CF7)),LARGE(CD7:CF7,2)/10,\"\")","v":6.7},{"$f":"IF(OR(ISNUMBER(CH7),ISNUMBER(CI7),ISNUMBER(CJ7)),LARGE(CH7:CJ7,1)/10,\"\")","v":6.7},{"$f":"IF(OR(ISNUMBER(CH7),ISNUMBER(CI7),ISNUMBER(CJ7)),LARGE(CH7:CJ7,2)/10,\"\")","v":6.7},{"$f":"IF(OR(ISNUMBER(CL7),ISNUMBER(CM7),ISNUMBER(CN7),ISNUMBER(CO7),ISNUMBER(CG7),ISNUMBER(CK7)),SUM(CL7,CM7,CN7,CO7,('TT 1'!BR8*0.3),(ANNUAL!BR8*0.3)),\"\")","v":26.8},{"$f":"IF(ISNUMBER(P7),P7,\"\")","v":32.799999999999997},{"$f":"IF(ISNUMBER(AC7),AC7,\"\")","v":46},{"$f":"IF(ISNUMBER(AP7),AP7,\"\")","v":38.799999999999997},{"$f":"IF(ISNUMBER(BC7),BC7,\"\")","v":26.8},{"$f":"IF(ISNUMBER(BP7),BP7,\"\")","v":26.8},{"$f":"IF(ISNUMBER(CC7),CC7,\"\")","v":26.8},{"$f":"IF(ISNUMBER(CP7),CP7,\"\")","v":26.8},{"$f":"SUM(CQ7:CW7)","v":224.80000000000004},{"$f":"CX7/'Student Profile'!P8","v":44.960000000000008},{"$f":"IF(ISNUMBER(CX7),RANK(CX7,CX$6:CX$50,0),\"\")","v":38}]
[{"$f":"ANNUAL!A10","v":""},{"$f":"ANNUAL!B10","v":""},{"$f":"IF('Student Profile'!D9>0,'Student Profile'!D9,\"\")","v":""},{"$f":"IF(ISNUMBER('UT1'!E10),'UT1'!E10,\"\")","v":92},{"$f":"IF(ISNUMBER('UT 2'!E10),'UT 2'!E10,\"\")","v":92},{"$f":"IF(ISNUMBER('UT 3 '!E10),'UT 3 '!E10,\"\")","v":92},{"$f":"IF('TT 1'!E10>0,'TT 1'!E10,\"\")","v":62},{"$f":"IF('UT 4'!E10>0,'UT 4'!E10,\"\")","v":92},{"$f":"IF('UT 5PB1'!E10>0,'UT 5PB1'!E10,\"\")","v":92},{"$f":"IF('PREANNU PB2 '!E10>0,'PREANNU PB2 '!E10,\"\")","v":92},{"$f":"IF(ANNUAL!E10>0,ANNUAL!E10,\"\")","v":55},9.1999999999999993,9.1999999999999993,9.1999999999999993,9.1999999999999993,{"$f":"IF(OR(ISNUMBER(L8),ISNUMBER(M8),ISNUMBER(N8),ISNUMBER(O8),ISNUMBER(G8),ISNUMBER(K8)),SUM(L8,M8,N8,O8,('TT 1'!D9*0.3),(ANNUAL!D9*0.3)),\"\")","v":45.8},{"$f":"IF(ISNUMBER('UT1'!H10),'UT1'!H10,\"\")","v":55},{"$f":"IF(ISNUMBER('UT 2'!H10),'UT 2'!H10,\"\")","v":92},{"$f":"IF(ISNUMBER('UT 3 '!H10),'UT 3 '!H10,\"\")","v":92},{"$f":"IF('TT 1'!H10>0,'TT 1'!H10,\"\")","v":92},{"$f":"IF('UT 4'!H10>0,'UT 4'!H10,\"\")","v":92},{"$f":"IF('UT 5PB1'!H10>0,'UT 5PB1'!H10,\"\")","v":92},{"$f":"IF('PREANNU PB2 '!H10>0,'PREANNU PB2 '!H10,\"\")","v":92},{"$f":"IF(ANNUAL!H10>0,ANNUAL!H10,\"\")","v":92},9.1999999999999993,9.1999999999999993,9.1999999999999993,9.1999999999999993,{"$f":"IF(OR(ISNUMBER(Y8),ISNUMBER(Z8),ISNUMBER(AA8),ISNUMBER(AB8),ISNUMBER(T8),ISNUMBER(X8)),SUM(Y8,Z8,AA8,AB8,('TT 1'!E9*0.3),(ANNUAL!E9*0.3)),\"\")","v":62.3},{"$f":"IF(ISNUMBER('UT1'!K10),'UT1'!K10,\"\")","v":92},{"$f":"IF(ISNUMBER('UT 2'!K10),'UT 2'!K10,\"\")","v":92},{"$f":"IF(ISNUMBER('UT 3 '!K10),'UT 3 '!K10,\"\")","v":92},{"$f":"IF('TT 1'!K10>0,'TT 1'!K10,\"\")","v":92},{"$f":"IF('UT 4'!K10>0,'UT 4'!K10,\"\")","v":92},{"$f":"IF('UT 5PB1'!K10>0,'UT 5PB1'!K10,\"\")","v":92},{"$f":"IF('PREANNU PB2 '!K10>0,'PREANNU PB2 '!K10,\"\")","v":92},{"$f":"IF(ANNUAL!K10>0,ANNUAL!K10,\"\")","v":92},9.1999999999999993,9.1999999999999993,9.1999999999999993,9.1999999999999993,{"$f":"IF(OR(ISNUMBER(AL8),ISNUMBER(AM8),ISNUMBER(AN8),ISNUMBER(AO8),ISNUMBER(AG8),ISNUMBER(AK8)),SUM(AL8,AM8,AN8,AO8,('TT 1'!R9*0.3),(ANNUAL!R9*0.3)),\"\")","v":51.8},{"$f":"IF(ISNUMBER('UT1'!N10),'UT1'!N10,\"\")","v":92},{"$f":"IF(ISNUMBER('UT 2'!N10),'UT 2'!N10,\"\")","v":92},{"$f":"IF(ISNUMBER('UT 3 '!N10),'UT 3 '!N10,\"\")","v":92},{"$f":"IF('TT 1'!N10>0,'TT 1'!N10,\"\")","v":92},{"$f":"IF('UT 4'!N10>0,'UT 4'!N10,\"\")","v":92},{"$f":"IF('UT 5PB1'!N10>0,'UT 5PB1'!N10,\"\")","v":92},{"$f":"IF('PREANNU PB2 '!N10>0,'PREANNU PB2 '!N10,\"\")","v":92},{"$f":"IF(ANNUAL!N10>0,ANNUAL!N10,\"\")","v":92},9.1999999999999993,9.1999999999999993,9.1999999999999993,9.1999999999999993,{"$f":"IF(OR(ISNUMBER(AY8),ISNUMBER(AZ8),ISNUMBER(BA8),ISNUMBER(BB8),ISNUMBER(AT8),ISNUMBER(AX8)),SUM(AY8,AZ8,BA8,BB8,('TT 1'!AE9*0.3),(ANNUAL!AE9*0.3)),\"\")","v":36.799999999999997},{"$f":"IF(ISNUMBER('UT1'!Q10),'UT1'!Q10,\"\")","v":92},{"$f":"IF(ISNUMBER('UT 2'!Q10),'UT 2'!Q10,\"\")","v":92},{"$f":"IF(ISNUMBER('UT 3 '!Q10),'UT 3 '!Q10,\"\")","v":92},{"$f":"IF('TT 1'!Q10>0,'TT 1'!Q10,\"\")","v":92},{"$f":"IF('UT 4'!Q10>0,'UT 4'!Q10,\"\")","v":92},{"$f":"IF('UT 5PB1'!Q10>0,'UT 5PB1'!Q10,\"\")","v":92},{"$f":"IF('PREANNU PB2 '!Q10>0,'PREANNU PB2 '!Q10,\"\")","v":92},{"$f":"IF(ANNUAL!Q10>0,ANNUAL!Q10,\"\")","v":92},9.1999999999999993,9.1999999999999993,9.1999999999999993,9.1999999999999993,{"$f":"IF(OR(ISNUMBER(BL8),ISNUMBER(BM8),ISNUMBER(BN8),ISNUMBER(BO8),ISNUMBER(BG8),ISNUMBER(BK8)),SUM(BL8,BM8,BN8,BO8,('TT 1'!AR9*0.3),(ANNUAL!AR9*0.3)),\"\")","v":36.799999999999997},{"$f":"IF(ISNUMBER('UT1'!T10),'UT1'!T10,\"\")","v":92},{"$f":"IF(ISNUMBER('UT 2'!T10),'UT 2'!T10,\"\")","v":92},{"$f":"IF(ISNUMBER('UT 3 '!T10),'UT 3 '!T10,\"\")","v":92},{"$f":"IF('TT 1'!T10>0,'TT 1'!T10,\"\")","v":92},{"$f":"IF('UT 4'!T10>0,'UT 4'!T10,\"\")","v":92},{"$f":"IF('UT 5PB1'!T10>0,'UT 5PB1'!T10,\"\")","v":92},{"$f":"IF('PREANNU PB2 '!T10>0,'PREANNU PB2 '!T10,\"\")","v":92},{"$f":"IF(ANNUAL!T10>0,ANNUAL!T10,\"\")","v":92},9.1999999999999993,9.1999999999999993,9.1999999999999993,9.1999999999999993,{"$f":"IF(OR(ISNUMBER(BY8),ISNUMBER(BZ8),ISNUMBER(CA8),ISNUMBER(CB8),ISNUMBER(BT8),ISNUMBER(BX8)),SUM(BY8,BZ8,CA8,CB8,('TT 1'!BE9*0.3),(ANNUAL!BE9*0.3)),\"\")","v":36.799999999999997},{"$f":"IF(ISNUMBER('UT1'!W10),'UT1'!W10,\"\")","v":92},{"$f":"IF(ISNUMBER('UT 2'!W10),'UT 2'!W10,\"\")","v":92},{"$f":"IF(ISNUMBER('UT 3 '!W10),'UT 3 '!W10,\"\")","v":92},{"$f":"IF('TT 1'!W10>0,'TT 1'!W10,\"\")","v":92},{"$f":"IF('UT 4'!W10>0,'UT 4'!W10,\"\")","v":92},{"$f":"IF('UT 5PB1'!W10>0,'UT 5PB1'!W10,\"\")","v":92},{"$f":"IF('PREANNU PB2 '!W10>0,'PREANNU PB2 '!W10,\"\")","v":92},{"$f":"IF(ANNUAL!W10>0,ANNUAL!W10,\"\")","v":92},9.1999999999999993,9.1999999999999993,9.1999999999999993,9.1999999999999993,{"$f":"IF(OR(ISNUMBER(CL8),ISNUMBER(CM8),ISNUMBER(CN8),ISNUMBER(CO8),ISNUMBER(CG8),ISNUMBER(CK8)),SUM(CL8,CM8,CN8,CO8,('TT 1'!BR9*0.3),(ANNUAL!BR9*0.3)),\"\")","v":36.799999999999997},45.8,62.3,51.8,36.799999999999997,36.799999999999997,36.799999999999997,36.799999999999997,307.10000000000002,{"$f":"CX8/'Student Profile'!P9","v":61.42},{"$f":"IF(ISNUMBER(CX8),RANK(CX8,CX$6:CX$50,0),\"\")","v":1}]
[{"$f":"ANNUAL!A11","v":""},{"$f":"ANNUAL!B11","v":""},{"$f":"IF('Student Profile'!D10>0,'Student Profile'!D10,\"\")","v":""},{"$f":"IF(ISNUMBER('UT1'!E11),'UT1'!E11,\"\")","v":70},{"$f":"IF(ISNUMBER('UT 2'!E11),'UT 2'!E11,\"\")","v":70},{"$f":"IF(ISNUMBER('UT 3 '!E11),'UT 3 '!E11,\"\")","v":70},{"$f":"IF('TT 1'!E11>0,'TT 1'!E11,\"\")","v":47},{"$f":"IF('UT 4'!E11>0,'UT 4'!E11,\"\")","v":70},{"$f":"IF('UT 5PB1'!E11>0,'UT 5PB1'!E11,\"\")","v":70},{"$f":"IF('PREANNU PB2 '!E11>0,'PREANNU PB2 '!E11,\"\")","v":70},{"$f":"IF(ANNUAL!E11>0,ANNUAL!E11,\"\")","v":42},7,7,7,7,{"$f":"IF(OR(ISNUMBER(L9),ISNUMBER(M9),ISNUMBER(N9),ISNUMBER(O9),ISNUMBER(G9),ISNUMBER(K9)),SUM(L9,M9,N9,O9,('TT 1'!D10*0.3),(ANNUAL!D10*0.3)),\"\")","v":40},{"$f":"IF(ISNUMBER('UT1'!H11),'UT1'!H11,\"\")","v":42},{"$f":"IF(ISNUMBER('UT 2'!H11),'UT 2'!H11,\"\")","v":70},{"$f":"IF(ISNUMBER('UT 3 '!H11),'UT 3 '!H11,\"\")","v":70},{"$f":"IF('TT 1'!H11>0,'TT 1'!H11,\"\")","v":70},{"$f":"IF('UT 4'!H11>0,'UT 4'!H11,\"\")","v":70},{"$f":"IF('UT 5PB1'!H11>0,'UT 5PB1'!H11,\"\")","v":70},{"$f":"IF('PREANNU PB2 '!H11>0,'PREANNU PB2 '!H11,\"\")","v":70},{"$f":"IF(ANNUAL!H11>0,ANNUAL!H11,\"\")","v":70},7,7,7,7,{"$f":"IF(OR(ISNUMBER(Y9),ISNUMBER(Z9),ISNUMBER(AA9),ISNUMBER(AB9),ISNUMBER(T9),ISNUMBER(X9)),SUM(Y9,Z9,AA9,AB9,('TT 1'!E10*0.3),(ANNUAL!E10*0.3)),\"\")","v":63.099999999999994},{"$f":"IF(ISNUMBER('UT1'!K11),'UT1'!K11,\"\")","v":70},{"$f":"IF(ISNUMBER('UT 2'!K11),'UT 2'!K11,\"\")","v":70},{"$f":"IF(ISNUMBER('UT 3 '!K11),'UT 3 '!K11,\"\")","v":70},{"$f":"IF('TT 1'!K11>0,'TT 1'!K11,\"\")","v":70},{"$f":"IF('UT 4'!K11>0,'UT 4'!K11,\"\")","v":70},{"$f":"IF('UT 5PB1'!K11>0,'UT 5PB1'!K11,\"\")","v":70},{"$f":"IF('PREANNU PB2 '!K11>0,'PREANNU PB2 '!K11,\"\")","v":70},{"$f":"IF(ANNUAL!K11>0,ANNUAL!K11,\"\")","v":70},7,7,7,7,{"$f":"IF(OR(ISNUMBER(AL9),ISNUMBER(AM9),ISNUMBER(AN9),ISNUMBER(AO9),ISNUMBER(AG9),ISNUMBER(AK9)),SUM(AL9,AM9,AN9,AO9,('TT 1'!R10*0.3),(ANNUAL!R10*0.3)),\"\")","v":49},{"$f":"IF(ISNUMBER('UT1'!N11),'UT1'!N11,\"\")","v":70},{"$f":"IF(ISNUMBER('UT 2'!N11),'UT 2'!N11,\"\")","v":70},{"$f":"IF(ISNUMBER('UT 3 '!N11),'UT 3 '!N11,\"\")","v":70},{"$f":"IF('TT 1'!N11>0,'TT 1'!N11,\"\")","v":70},{"$f":"IF('UT 4'!N11>0,'UT 4'!N11,\"\")","v":70},{"$f":"IF('UT 5PB1'!N11>0,'UT 5PB1'!N11,\"\")","v":70},{"$f":"IF('PREANNU PB2 '!N11>0,'PREANNU PB2 '!N11,\"\")","v":70},{"$f":"IF(ANNUAL!N11>0,ANNUAL!N11,\"\")","v":70},7,7,7,7,{"$f":"IF(OR(ISNUMBER(AY9),ISNUMBER(AZ9),ISNUMBER(BA9),ISNUMBER(BB9),ISNUMBER(AT9),ISNUMBER(AX9)),SUM(AY9,AZ9,BA9,BB9,('TT 1'!AE10*0.3),(ANNUAL!AE10*0.3)),\"\")","v":28},{"$f":"IF(ISNUMBER('UT1'!Q11),'UT1'!Q11,\"\")","v":70},{"$f":"IF(ISNUMBER('UT 2'!Q11),'UT 2'!Q11,\"\")","v":70},{"$f":"IF(ISNUMBER('UT 3 '!Q11),'UT 3 '!Q11,\"\")","v":70},{"$f":"IF('TT 1'!Q11>0,'TT 1'!Q11,\"\")","v":70},{"$f":"IF('UT 4'!Q11>0,'UT 4'!Q11,\"\")","v":70},{"$f":"IF('UT 5PB1'!Q11>0,'UT 5PB1'!Q11,\"\")","v":70},{"$f":"IF('PREANNU PB2 '!Q11>0,'PREANNU PB2 '!Q11,\"\")","v":70},{"$f":"IF(ANNUAL!Q11>0,ANNUAL!Q11,\"\")","v":70},7,7,7,7,{"$f":"IF(OR(ISNUMBER(BL9),ISNUMBER(BM9),ISNUMBER(BN9),ISNUMBER(BO9),ISNUMBER(BG9),ISNUMBER(BK9)),SUM(BL9,BM9,BN9,BO9,('TT 1'!AR10*0.3),(ANNUAL!AR10*0.3)),\"\")","v":28},{"$f":"IF(ISNUMBER('UT1'!T11),'UT1'!T11,\"\")","v":70},{"$f":"IF(ISNUMBER('UT 2'!T11),'UT 2'!T11,\"\")","v":70},{"$f":"IF(ISNUMBER('UT 3 '!T11),'UT 3 '!T11,\"\")","v":70},{"$f":"IF('TT 1'!T11>0,'TT 1'!T11,\"\")","v":70},{"$f":"IF('UT 4'!T11>0,'UT 4'!T11,\"\")","v":70},{"$f":"IF('UT 5PB1'!T11>0,'UT 5PB1'!T11,\"\")","v":70},{"$f":"IF('PREANNU PB2 '!T11>0,'PREANNU PB2 '!T11,\"\")","v":70},{"$f":"IF(ANNUAL!T11>0,ANNUAL!T11,\"\")","v":70},7,7,7,7,{"$f":"IF(OR(ISNUMBER(BY9),ISNUMBER(BZ9),ISNUMBER(CA9),ISNUMBER(CB9),ISNUMBER(BT9),ISNUMBER(BX9)),SUM(BY9,BZ9,CA9,CB9,('TT 1'!BE10*0.3),(ANNUAL!BE10*0.3)),\"\")","v":28},{"$f":"IF(ISNUMBER('UT1'!W11),'UT1'!W11,\"\")","v":70},{"$f":"IF(ISNUMBER('UT 2'!W11),'UT 2'!W11,\"\")","v":70},{"$f":"IF(ISNUMBER('UT 3 '!W11),'UT 3 '!W11,\"\")","v":70},{"$f":"IF('TT 1'!W11>0,'TT 1'!W11,\"\")","v":70},{"$f":"IF('UT 4'!W11>0,'UT 4'!W11,\"\")","v":70},{"$f":"IF('UT 5PB1'!W11>0,'UT 5PB1'!W11,\"\")","v":70},{"$f":"IF('PREANNU PB2 '!W11>0,'PREANNU PB2 '!W11,\"\")","v":70},{"$f":"IF(ANNUAL!W11>0,ANNUAL!W11,\"\")","v":70},7,7,7,7,{"$f":"IF(OR(ISNUMBER(CL9),ISNUMBER(CM9),ISNUMBER(CN9),ISNUMBER(CO9),ISNUMBER(CG9),ISNUMBER(CK9)),SUM(CL9,CM9,CN9,CO9,('TT 1'!BR10*0.3),(ANNUAL!BR10*0.3)),\"\")","v":28},40,63.099999999999994,49,28,28,28,28,264.10000000000002,{"$f":"CX9/'Student Profile'!P10","v":52.820000000000007},28]
[{"$f":"ANNUAL!A12","v":""},{"$f":"ANNUAL!B12","v":""},{"$f":"IF('Student Profile'!D11>0,'Student Profile'!D11,\"\")","v":""},{"$f":"IF(ISNUMBER('UT1'!E12),'UT1'!E12,\"\")","v":82},{"$f":"IF(ISNUMBER('UT 2'!E12),'UT 2'!E12,\"\")","v":82},{"$f":"IF(ISNUMBER('UT 3 '!E12),'UT 3 '!E12,\"\")","v":82},{"$f":"IF('TT 1'!E12>0,'TT 1'!E12,\"\")","v":55},{"$f":"IF('UT 4'!E12>0,'UT 4'!E12,\"\")","v":82},{"$f":"IF('UT 5PB1'!E12>0,'UT 5PB1'!E12,\"\")","v":82},{"$f":"IF('PREANNU PB2 '!E12>0,'PREANNU PB2 '!E12,\"\")","v":82},{"$f":"IF(ANNUAL!E12>0,ANNUAL!E12,\"\")","v":49},8.1999999999999993,8.1999999999999993,8.1999999999999993,8.1999999999999993,{"$f":"IF(OR(ISNUMBER(L10),ISNUMBER(M10),ISNUMBER(N10),ISNUMBER(O10),ISNUMBER(G10),ISNUMBER(K10)),SUM(L10,M10,N10,O10,('TT 1'!D11*0.3),(ANNUAL!D11*0.3)),\"\")","v":43},{"$f":"IF(ISNUMBER('UT1'!H12),'UT1'!H12,\"\")","v":49},{"$f":"IF(ISNUMBER('UT 2'!H12),'UT 2'!H12,\"\")","v":82},{"$f":"IF(ISNUMBER('UT 3 '!H12),'UT 3 '!H12,\"\")","v":82},{"$f":"IF('TT 1'!H12>0,'TT 1'!H12,\"\")","v":82},{"$f":"IF('UT 4'!H12>0,'UT 4'!H12,\"\")","v":82},{"$f":"IF('UT 5PB1'!H12>0,'UT 5PB1'!H12,\"\")","v":82},{"$f":"IF('PREANNU PB2 '!H12>0,'PREANNU PB2 '!H12,\"\")","v":82},{"$f":"IF(ANNUAL!H12>0,ANNUAL!H12,\"\")","v":82},8.1999999999999993,8.1999999999999993,8.1999999999999993,8.1999999999999993,{"$f":"IF(OR(ISNUMBER(Y10),ISNUMBER(Z10),ISNUMBER(AA10),ISNUMBER(AB10),ISNUMBER(T10),ISNUMBER(X10)),SUM(Y10,Z10,AA10,AB10,('TT 1'!E11*0.3),(ANNUAL!E11*0.3)),\"\")","v":59.5},{"$f":"IF(ISNUMBER('UT1'!K12),'UT1'!K12,\"\")","v":82},{"$f":"IF(ISNUMBER('UT 2'!K12),'UT 2'!K12,\"\")","v":82},{"$f":"IF(ISNUMBER('UT 3 '!K12),'UT 3 '!K12,\"\")","v":82},{"$f":"IF('TT 1'!K12>0,'TT 1'!K12,\"\")","v":82},{"$f":"IF('UT 4'!K12>0,'UT 4'!K12,\"\")","v":82},{"$f":"IF('UT 5PB1'!K12>0,'UT 5PB1'!K12,\"\")","v":82},{"$f":"IF('PREANNU PB2 '!K12>0,'PREANNU PB2 '!K12,\"\")","v":82},{"$f":"IF(ANNUAL!K12>0,ANNUAL!K12,\"\")","v":82},8.1999999999999993,8.1999999999999993,8.1999999999999993,8.1999999999999993,{"$f":"IF(OR(ISNUMBER(AL10),ISNUMBER(AM10),ISNUMBER(AN10),ISNUMBER(AO10),ISNUMBER(AG10),ISNUMBER(AK10)),SUM(AL10,AM10,AN10,AO10,('TT 1'!R11*0.3),(ANNUAL!R11*0.3)),\"\")","v":47.8},{"$f":"IF(ISNUMBER('UT1'!N12),'UT1'!N12,\"\")","v":82},{"$f":"IF(ISNUMBER('UT 2'!N12),'UT 2'!N12,\"\")","v":82},{"$f":"IF(ISNUMBER('UT 3 '!N12),'UT 3 '!N12,\"\")","v":82},{"$f":"IF('TT 1'!N12>0,'TT 1'!N12,\"\")","v":82},{"$f":"IF('UT 4'!N12>0,'UT 4'!N12,\"\")","v":82},{"$f":"IF('UT 5PB1'!N12>0,'UT 5PB1'!N12,\"\")","v":82},{"$f":"IF('PREANNU PB2 '!N12>0,'PREANNU PB2 '!N12,\"\")","v":82},{"$f":"IF(ANNUAL!N12>0,ANNUAL!N12,\"\")","v":82},8.1999999999999993,8.1999999999999993,8.1999999999999993,8.1999999999999993,{"$f":"IF(OR(ISNUMBER(AY10),ISNUMBER(AZ10),ISNUMBER(BA10),ISNUMBER(BB10),ISNUMBER(AT10),ISNUMBER(AX10)),SUM(AY10,AZ10,BA10,BB10,('TT 1'!AE11*0.3),(ANNUAL!AE11*0.3)),\"\")","v":32.799999999999997},{"$f":"IF(ISNUMBER('UT1'!Q12),'UT1'!Q12,\"\")","v":82},{"$f":"IF(ISNUMBER('UT 2'!Q12),'UT 2'!Q12,\"\")","v":82},{"$f":"IF(ISNUMBER('UT 3 '!Q12),'UT 3 '!Q12,\"\")","v":82},{"$f":"IF('TT 1'!Q12>0,'TT 1'!Q12,\"\")","v":82},{"$f":"IF('UT 4'!Q12>0,'UT 4'!Q12,\"\")","v":82},{"$f":"IF('UT 5PB1'!Q12>0,'UT 5PB1'!Q12,\"\")","v":82},{"$f":"IF('PREANNU PB2 '!Q12>0,'PREANNU PB2 '!Q12,\"\")","v":82},{"$f":"IF(ANNUAL!Q12>0,ANNUAL!Q12,\"\")","v":82},8.1999999999999993,8.1999999999999993,8.1999999999999993,8.1999999999999993,{"$f":"IF(OR(ISNUMBER(BL10),ISNUMBER(BM10),ISNUMBER(BN10),ISNUMBER(BO10),ISNUMBER(BG10),ISNUMBER(BK10)),SUM(BL10,BM10,BN10,BO10,('TT 1'!AR11*0.3),(ANNUAL!AR11*0.3)),\"\")","v":32.799999999999997},{"$f":"IF(ISNUMBER('UT1'!T12),'UT1'!T12,\"\")","v":82},{"$f":"IF(ISNUMBER('UT 2'!T12),'UT 2'!T12,\"\")","v":82},{"$f":"IF(ISNUMBER('UT 3 '!T12),'UT 3 '!T12,\"\")","v":82},{"$f":"IF('TT 1'!T12>0,'TT 1'!T12,\"\")","v":82},{"$f":"IF('UT 4'!T12>0,'UT 4'!T12,\"\")","v":82},{"$f":"IF('UT 5PB1'!T12>0,'UT 5PB1'!T12,\"\")","v":82},{"$f":"IF('PREANNU PB2 '!T12>0,'PREANNU PB2 '!T12,\"\")","v":82},{"$f":"IF(ANNUAL!T12>0,ANNUAL!T12,\"\")","v":82},8.1999999999999993,8.1999999999999993,8.1999999999999993,8.1999999999999993,{"$f":"IF(OR(ISNUMBER(BY10),ISNUMBER(BZ10),ISNUMBER(CA10),ISNUMBER(CB10),ISNUMBER(BT10),ISNUMBER(BX10)),SUM(BY10,BZ10,CA10,CB10,('TT 1'!BE11*0.3),(ANNUAL!BE11*0.3)),\"\")","v":32.799999999999997},{"$f":"IF(ISNUMBER('UT1'!W12),'UT1'!W12,\"\")","v":82},{"$f":"IF(ISNUMBER('UT 2'!W12),'UT 2'!W12,\"\")","v":82},{"$f":"IF(ISNUMBER('UT 3 '!W12),'UT 3 '!W12,\"\")","v":82},{"$f":"IF('TT 1'!W12>0,'TT 1'!W12,\"\")","v":82},{"$f":"IF('UT 4'!W12>0,'UT 4'!W12,\"\")","v":82},{"$f":"IF('UT 5PB1'!W12>0,'UT 5PB1'!W12,\"\")","v":82},{"$f":"IF('PREANNU PB2 '!W12>0,'PREANNU PB2 '!W12,\"\")","v":82},{"$f":"IF(ANNUAL!W12>0,ANNUAL!W12,\"\")","v":82},8.1999999999999993,8.1999999999999993,8.1999999999999993,8.1999999999999993,{"$f":"IF(OR(ISNUMBER(CL10),ISNUMBER(CM10),ISNUMBER(CN10),ISNUMBER(CO10),ISNUMBER(CG10),ISNUMBER(CK10)),SUM(CL10,CM10,CN10,CO10,('TT 1'!BR11*0.3),(ANNUAL!BR11*0.3)),\"\")","v":32.799999999999997},43,59.5,47.8,32.799999999999997,32.799999999999997,32.799999999999997,32.799999999999997,281.50000000000006,{"$f":"CX10/'Student Profile'!P11","v":56.300000000000011},10]
[{"$f":"ANNUAL!A13","v":""},{"$f":"ANNUAL!B13","v":""},{"$f":"IF('Student Profile'!D12>0,'Student Profile'!D12,\"\")","v":""},{"$f":"IF(ISNUMBER('UT1'!E13),'UT1'!E13,\"\")","v":85},{"$f":"IF(ISNUMBER('UT 2'!E13),'UT 2'!E13,\"\")","v":85},{"$f":"IF(ISNUMBER('UT 3 '!E13),'UT 3 '!E13,\"\")","v":85},{"$f":"IF('TT 1'!E13>0,'TT 1'!E13,\"\")","v":57},{"$f":"IF('UT 4'!E13>0,'UT 4'!E13,\"\")","v":85},{"$f":"IF('UT 5PB1'!E13>0,'UT 5PB1'!E13,\"\")","v":85},{"$f":"IF('PREANNU PB2 '!E13>0,'PREANNU PB2 '!E13,\"\")","v":85},{"$f":"IF(ANNUAL!E13>0,ANNUAL!E13,\"\")","v":51},8.5,8.5,8.5,8.5,{"$f":"IF(OR(ISNUMBER(L11),ISNUMBER(M11),ISNUMBER(N11),ISNUMBER(O11),ISNUMBER(G11),ISNUMBER(K11)),SUM(L11,M11,N11,O11,('TT 1'!D12*0.3),(ANNUAL!D12*0.3)),\"\")","v":43},{"$f":"IF(ISNUMBER('UT1'!H13),'UT1'!H13,\"\")","v":51},{"$f":"IF(ISNUMBER('UT 2'!H13),'UT 2'!H13,\"\")","v":85},{"$f":"IF(ISNUMBER('UT 3 '!H13),'UT 3 '!H13,\"\")","v":85},{"$f":"IF('TT 1'!H13>0,'TT 1'!H13,\"\")","v":85},{"$f":"IF('UT 4'!H13>0,'UT 4'!H13,\"\")","v":85},{"$f":"IF('UT 5PB1'!H13>0,'UT 5PB1'!H13,\"\")","v":85},{"$f":"IF('PREANNU PB2 '!H13>0,'PREANNU PB2 '!H13,\"\")","v":85},{"$f":"IF(ANNUAL!H13>0,ANNUAL!H13,\"\")","v":85},8.5,8.5,8.5,8.5,{"$f":"IF(OR(ISNUMBER(Y11),ISNUMBER(Z11),ISNUMBER(AA11),ISNUMBER(AB11),ISNUMBER(T11),ISNUMBER(X11)),SUM(Y11,Z11,AA11,AB11,('TT 1'!E12*0.3),(ANNUAL!E12*0.3)),\"\")","v":65.2},{"$f":"IF(ISNUMBER('UT1'!K13),'UT1'!K13,\"\")","v":85},{"$f":"IF(ISNUMBER('UT 2'!K13),'UT 2'!K13,\"\")","v":85},{"$f":"IF(ISNUMBER('UT 3 '!K13),'UT 3 '!K13,\"\")","v":85},{"$f":"IF('TT 1'!K13>0,'TT 1'!K13,\"\")","v":85},{"$f":"IF('UT 4'!K13>0,'UT 4'!K13,\"\")","v":85},{"$f":"IF('UT 5PB1'!K13>0,'UT 5PB1'!K13,\"\")","v":85},{"$f":"IF('PREANNU PB2 '!K13>0,'PREANNU PB2 '!K13,\"\")","v":85},{"$f":"IF(ANNUAL!K13>0,ANNUAL!K13,\"\")","v":85},8.5,8.5,8.5,8.5,{"$f":"IF(OR(ISNUMBER(AL11),ISNUMBER(AM11),ISNUMBER(AN11),ISNUMBER(AO11),ISNUMBER(AG11),ISNUMBER(AK11)),SUM(AL11,AM11,AN11,AO11,('TT 1'!R12*0.3),(ANNUAL!R12*0.3)),\"\")","v":54.400000000000006},{"$f":"IF(ISNUMBER('UT1'!N13),'UT1'!N13,\"\")","v":85},{"$f":"IF(ISNUMBER('UT 2'!N13),'UT 2'!N13,\"\")","v":85},{"$f":"IF(ISNUMBER('UT 3 '!N13),'UT 3 '!N13,\"\")","v":85},{"$f":"IF('TT 1'!N13>0,'TT 1'!N13,\"\")","v":85},{"$f":"IF('UT 4'!N13>0,'UT 4'!N13,\"\")","v":85},{"$f":"IF('UT 5PB1'!N13>0,'UT 5PB1'!N13,\"\")","v":85},{"$f":"IF('PREANNU PB2 '!N13>0,'PREANNU PB2 '!N13,\"\")","v":85},{"$f":"IF(ANNUAL!N13>0,ANNUAL!N13,\"\")","v":85},8.5,8.5,8.5,8.5,{"$f":"IF(OR(ISNUMBER(AY11),ISNUMBER(AZ11),ISNUMBER(BA11),ISNUMBER(BB11),ISNUMBER(AT11),ISNUMBER(AX11)),SUM(AY11,AZ11,BA11,BB11,('TT 1'!AE12*0.3),(ANNUAL!AE12*0.3)),\"\")","v":34},{"$f":"IF(ISNUMBER('UT1'!Q13),'UT1'!Q13,\"\")","v":85},{"$f":"IF(ISNUMBER('UT 2'!Q13),'UT 2'!Q13,\"\")","v":85},{"$f":"IF(ISNUMBER('UT 3 '!Q13),'UT 3 '!Q13,\"\")","v":85},{"$f":"IF('TT 1'!Q13>0,'TT 1'!Q13,\"\")","v":85},{"$f":"IF('UT 4'!Q13>0,'UT 4'!Q13,\"\")","v":85},{"$f":"IF('UT 5PB1'!Q13>0,'UT 5PB1'!Q13,\"\")","v":85},{"$f":"IF('PREANNU PB2 '!Q13>0,'PREANNU PB2 '!Q13,\"\")","v":85},{"$f":"IF(ANNUAL!Q13>0,ANNUAL!Q13,\"\")","v":85},8.5,8.5,8.5,8.5,{"$f":"IF(OR(ISNUMBER(BL11),ISNUMBER(BM11),ISNUMBER(BN11),ISNUMBER(BO11),ISNUMBER(BG11),ISNUMBER(BK11)),SUM(BL11,BM11,BN11,BO11,('TT 1'!AR12*0.3),(ANNUAL!AR12*0.3)),\"\")","v":34},{"$f":"IF(ISNUMBER('UT1'!T13),'UT1'!T13,\"\")","v":85},{"$f":"IF(ISNUMBER('UT 2'!T13),'UT 2'!T13,\"\")","v":85},{"$f":"IF(ISNUMBER('UT 3 '!T13),'UT 3 '!T13,\"\")","v":85},{"$f":"IF('TT 1'!T13>0,'TT 1'!T13,\"\")","v":85},{"$f":"IF('UT 4'!T13>0,'UT 4'!T13,\"\")","v":85},{"$f":"IF('UT 5PB1'!T13>0,'UT 5PB1'!T13,\"\")","v":85},{"$f":"IF('PREANNU PB2 '!T13>0,'PREANNU PB2 '!T13,\"\")","v":85},{"$f":"IF(ANNUAL!T13>0,ANNUAL!T13,\"\")","v":85},8.5,8.5,8.5,8.5,{"$f":"IF(OR(ISNUMBER(BY11),ISNUMBER(BZ11),ISNUMBER(CA11),ISNUMBER(CB11),ISNUMBER(BT11),ISNUMBER(BX11)),SUM(BY11,BZ11,CA11,CB11,('TT 1'!BE12*0.3),(ANNUAL!BE12*0.3)),\"\")","v":34},{"$f":"IF(ISNUMBER('UT1'!W13),'UT1'!W13,\"\")","v":85},{"$f":"IF(ISNUMBER('UT 2'!W13),'UT 2'!W13,\"\")","v":85},{"$f":"IF(ISNUMBER('UT 3 '!W13),'UT 3 '!W13,\"\")","v":85},{"$f":"IF('TT 1'!W13>0,'TT 1'!W13,\"\")","v":85},{"$f":"IF('UT 4'!W13>0,'UT 4'!W13,\"\")","v":85},{"$f":"IF('UT 5PB1'!W13>0,'UT 5PB1'!W13,\"\")","v":85},{"$f":"IF('PREANNU PB2 '!W13>0,'PREANNU PB2 '!W13,\"\")","v":85},{"$f":"IF(ANNUAL!W13>0,ANNUAL!W13,\"\")","v":85},8.5,8.5,8.5,8.5,{"$f":"IF(OR(ISNUMBER(CL11),ISNUMBER(CM11),ISNUMBER(CN11),ISNUMBER(CO11),ISNUMBER(CG11),ISNUMBER(CK11)),SUM(CL11,CM11,CN11,CO11,('TT 1'!BR12*0.3),(ANNUAL!BR12*0.3)),\"\")","v":34},43,65.2,54.400000000000006,34,34,34,34,298.60000000000002,{"$f":"CX11/'Student Profile'!P12","v":59.720000000000006},5]
[{"$f":"ANNUAL!A14","v":""},{"$f":"ANNUAL!B14","v":""},{"$f":"IF('Student Profile'!D13>0,'Student Profile'!D13,\"\")","v":""},{"$f":"IF(ISNUMBER('UT1'!E14),'UT1'!E14,\"\")","v":67},{"$f":"IF(ISNUMBER('UT 2'!E14),'UT 2'!E14,\"\")","v":67},{"$f":"IF(ISNUMBER('UT 3 '!E14),'UT 3 '!E14,\"\")","v":67},{"$f":"IF('TT 1'!E14>0,'TT 1'!E14,\"\")","v":45},{"$f":"IF('UT 4'!E14>0,'UT 4'!E14,\"\")","v":67},{"$f":"IF('UT 5PB1'!E14>0,'UT 5PB1'!E14,\"\")","v":67},{"$f":"IF('PREANNU PB2 '!E14>0,'PREANNU PB2 '!E14,\"\")","v":67},{"$f":"IF(ANNUAL!E14>0,ANNUAL!E14,\"\")","v":40},6.7,6.7,6.7,6.7,{"$f":"IF(OR(ISNUMBER(L12),ISNUMBER(M12),ISNUMBER(N12),ISNUMBER(O12),ISNUMBER(G12),ISNUMBER(K12)),SUM(L12,M12,N12,O12,('TT 1'!D13*0.3),(ANNUAL!D13*0.3)),\"\")","v":35.799999999999997},{"$f":"IF(ISNUMBER('UT1'!H14),'UT1'!H14,\"\")","v":40},{"$f":"IF(ISNUMBER('UT 2'!H14),'UT 2'!H14,\"\")","v":67},{"$f":"IF(ISNUMBER('UT 3 '!H14),'UT 3 '!H14,\"\")","v":67},{"$f":"IF('TT 1'!H14>0,'TT 1'!H14,\"\")","v":67},{"$f":"IF('UT 4'!H14>0,'UT 4'!H14,\"\")","v":67},{"$f":"IF('UT 5PB1'!H14>0,'UT 5PB1'!H14,\"\")","v":67},{"$f":"IF('PREANNU PB2 '!H14>0,'PREANNU PB2 '!H14,\"\")","v":67},{"$f":"IF(ANNUAL!H14>0,ANNUAL!H14,\"\")","v":67},6.7,6.7,6.7,6.7,{"$f":"IF(OR(ISNUMBER(Y12),ISNUMBER(Z12),ISNUMBER(AA12),ISNUMBER(AB12),ISNUMBER(T12),ISNUMBER(X12)),SUM(Y12,Z12,AA12,AB12,('TT 1'!E13*0.3),(ANNUAL!E13*0.3)),\"\")","v":59.199999999999996},{"$f":"IF(ISNUMBER('UT1'!K14),'UT1'!K14,\"\")","v":67},{"$f":"IF(ISNUMBER('UT 2'!K14),'UT 2'!K14,\"\")","v":67},{"$f":"IF(ISNUMBER('UT 3 '!K14),'UT 3 '!K14,\"\")","v":67},{"$f":"IF('TT 1'!K14>0,'TT 1'!K14,\"\")","v":67},{"$f":"IF('UT 4'!K14>0,'UT 4'!K14,\"\")","v":67},{"$f":"IF('UT 5PB1'!K14>0,'UT 5PB1'!K14,\"\")","v":67},{"$f":"IF('PREANNU PB2 '!K14>0,'PREANNU PB2 '!K14,\"\")","v":67},{"$f":"IF(ANNUAL!K14>0,ANNUAL!K14,\"\")","v":67},6.7,6.7,6.7,6.7,{"$f":"IF(OR(ISNUMBER(AL12),ISNUMBER(AM12),ISNUMBER(AN12),ISNUMBER(AO12),ISNUMBER(AG12),ISNUMBER(AK12)),SUM(AL12,AM12,AN12,AO12,('TT 1'!R13*0.3),(ANNUAL!R13*0.3)),\"\")","v":48.4},{"$f":"IF(ISNUMBER('UT1'!N14),'UT1'!N14,\"\")","v":67},{"$f":"IF(ISNUMBER('UT 2'!N14),'UT 2'!N14,\"\")","v":67},{"$f":"IF(ISNUMBER('UT 3 '!N14),'UT 3 '!N14,\"\")","v":67},{"$f":"IF('TT 1'!N14>0,'TT 1'!N14,\"\")","v":67},{"$f":"IF('UT 4'!N14>0,'UT 4'!N14,\"\")","v":67},{"$f":"IF('UT 5PB1'!N14>0,'UT 5PB1'!N14,\"\")","v":67},{"$f":"IF('PREANNU PB2 '!N14>0,'PREANNU PB2 '!N14,\"\")","v":67},{"$f":"IF(ANNUAL!N14>0,ANNUAL!N14,\"\")","v":67},6.7,6.7,6.7,6.7,{"$f":"IF(OR(ISNUMBER(AY12),ISNUMBER(AZ12),ISNUMBER(BA12),ISNUMBER(BB12),ISNUMBER(AT12),ISNUMBER(AX12)),SUM(AY12,AZ12,BA12,BB12,('TT 1'!AE13*0.3),(ANNUAL!AE13*0.3)),\"\")","v":26.8},{"$f":"IF(ISNUMBER('UT1'!Q14),'UT1'!Q14,\"\")","v":67},{"$f":"IF(ISNUMBER('UT 2'!Q14),'UT 2'!Q14,\"\")","v":67},{"$f":"IF(ISNUMBER('UT 3 '!Q14),'UT 3 '!Q14,\"\")","v":67},{"$f":"IF('TT 1'!Q14>0,'TT 1'!Q14,\"\")","v":67},{"$f":"IF('UT 4'!Q14>0,'UT 4'!Q14,\"\")","v":67},{"$f":"IF('UT 5PB1'!Q14>0,'UT 5PB1'!Q14,\"\")","v":67},{"$f":"IF('PREANNU PB2 '!Q14>0,'PREANNU PB2 '!Q14,\"\")","v":67},{"$f":"IF(ANNUAL!Q14>0,ANNUAL!Q14,\"\")","v":67},6.7,6.7,6.7,6.7,{"$f":"IF(OR(ISNUMBER(BL12),ISNUMBER(BM12),ISNUMBER(BN12),ISNUMBER(BO12),ISNUMBER(BG12),ISNUMBER(BK12)),SUM(BL12,BM12,BN12,BO12,('TT 1'!AR13*0.3),(ANNUAL!AR13*0.3)),\"\")","v":26.8},{"$f":"IF(ISNUMBER('UT1'!T14),'UT1'!T14,\"\")","v":67},{"$f":"IF(ISNUMBER('UT 2'!T14),'UT 2'!T14,\"\")","v":67},{"$f":"IF(ISNUMBER('UT 3 '!T14),'UT 3 '!T14,\"\")","v":67},{"$f":"IF('TT 1'!T14>0,'TT 1'!T14,\"\")","v":67},{"$f":"IF('UT 4'!T14>0,'UT 4'!T14,\"\")","v":67},{"$f":"IF('UT 5PB1'!T14>0,'UT 5PB1'!T14,\"\")","v":67},{"$f":"IF('PREANNU PB2 '!T14>0,'PREANNU PB2 '!T14,\"\")","v":67},{"$f":"IF(ANNUAL!T14>0,ANNUAL!T14,\"\")","v":67},6.7,6.7,6.7,6.7,{"$f":"IF(OR(ISNUMBER(BY12),ISNUMBER(BZ12),ISNUMBER(CA12),ISNUMBER(CB12),ISNUMBER(BT12),ISNUMBER(BX12)),SUM(BY12,BZ12,CA12,CB12,('TT 1'!BE13*0.3),(ANNUAL!BE13*0.3)),\"\")","v":26.8},{"$f":"IF(ISNUMBER('UT1'!W14),'UT1'!W14,\"\")","v":67},{"$f":"IF(ISNUMBER('UT 2'!W14),'UT 2'!W14,\"\")","v":67},{"$f":"IF(ISNUMBER('UT 3 '!W14),'UT 3 '!W14,\"\")","v":67},{"$f":"IF('TT 1'!W14>0,'TT 1'!W14,\"\")","v":67},{"$f":"IF('UT 4'!W14>0,'UT 4'!W14,\"\")","v":67},{"$f":"IF('UT 5PB1'!W14>0,'UT 5PB1'!W14,\"\")","v":67},{"$f":"IF('PREANNU PB2 '!W14>0,'PREANNU PB2 '!W14,\"\")","v":67},{"$f":"IF(ANNUAL!W14>0,ANNUAL!W14,\"\")","v":67},6.7,6.7,6.7,6.7,{"$f":"IF(OR(ISNUMBER(CL12),ISNUMBER(CM12),ISNUMBER(CN12),ISNUMBER(CO12),ISNUMBER(CG12),ISNUMBER(CK12)),SUM(CL12,CM12,CN12,CO12,('TT 1'!BR13*0.3),(ANNUAL!BR13*0.3)),\"\")","v":26.8},35.799999999999997,59.199999999999996,48.4,26.8,26.8,26.8,26.8,250.60000000000005,{"$f":"CX12/'Student Profile'!P13","v":50.120000000000012},32]
[{"$f":"ANNUAL!A15","v":""},{"$f":"ANNUAL!B15","v":""},{"$f":"IF('Student Profile'!D14>0,'Student Profile'!D14,\"\")","v":""},{"$f":"IF(ISNUMBER('UT1'!E15),'UT1'!E15,\"\")","v":82},{"$f":"IF(ISNUMBER('UT 2'!E15),'UT 2'!E15,\"\")","v":82},{"$f":"IF(ISNUMBER('UT 3 '!E15),'UT 3 '!E15,\"\")","v":82},{"$f":"IF('TT 1'!E15>0,'TT 1'!E15,\"\")","v":55},{"$f":"IF('UT 4'!E15>0,'UT 4'!E15,\"\")","v":82},{"$f":"IF('UT 5PB1'!E15>0,'UT 5PB1'!E15,\"\")","v":82},{"$f":"IF('PREANNU PB2 '!E15>0,'PREANNU PB2 '!E15,\"\")","v":82},{"$f":"IF(ANNUAL!E15>0,ANNUAL!E15,\"\")","v":49},8.1999999999999993,8.1999999999999993,8.1999999999999993,8.1999999999999993,{"$f":"IF(OR(ISNUMBER(L13),ISNUMBER(M13),ISNUMBER(N13),ISNUMBER(O13),ISNUMBER(G13),ISNUMBER(K13)),SUM(L13,M13,N13,O13,('TT 1'!D14*0.3),(ANNUAL!D14*0.3)),\"\")","v":41.8},{"$f":"IF(ISNUMBER('UT1'!H15),'UT1'!H15,\"\")","v":49},{"$f":"IF(ISNUMBER('UT 2'!H15),'UT 2'!H15,\"\")","v":82},{"$f":"IF(ISNUMBER('UT 3 '!H15),'UT 3 '!H15,\"\")","v":82},{"$f":"IF('TT 1'!H15>0,'TT 1'!H15,\"\")","v":82},{"$f":"IF('UT 4'!H15>0,'UT 4'!H15,\"\")","v":82},{"$f":"IF('UT 5PB1'!H15>0,'UT 5PB1'!H15,\"\")","v":82},{"$f":"IF('PREANNU PB2 '!H15>0,'PREANNU PB2 '!H15,\"\")","v":82},{"$f":"IF(ANNUAL!H15>0,ANNUAL!H15,\"\")","v":82},8.1999999999999993,8.1999999999999993,8.1999999999999993,8.1999999999999993,{"$f":"IF(OR(ISNUMBER(Y13),ISNUMBER(Z13),ISNUMBER(AA13),ISNUMBER(AB13),ISNUMBER(T13),ISNUMBER(X13)),SUM(Y13,Z13,AA13,AB13,('TT 1'!E14*0.3),(ANNUAL!E14*0.3)),\"\")","v":58.3},{"$f":"IF(ISNUMBER('UT1'!K15),'UT1'!K15,\"\")","v":82},{"$f":"IF(ISNUMBER('UT 2'!K15),'UT 2'!K15,\"\")","v":82},{"$f":"IF(ISNUMBER('UT 3 '!K15),'UT 3 '!K15,\"\")","v":82},{"$f":"IF('TT 1'!K15>0,'TT 1'!K15,\"\")","v":82},{"$f":"IF('UT 4'!K15>0,'UT 4'!K15,\"\")","v":82},{"$f":"IF('UT 5PB1'!K15>0,'UT 5PB1'!K15,\"\")","v":82},{"$f":"IF('PREANNU PB2 '!K15>0,'PREANNU PB2 '!K15,\"\")","v":82},{"$f":"IF(ANNUAL!K15>0,ANNUAL!K15,\"\")","v":82},8.1999999999999993,8.1999999999999993,8.1999999999999993,8.1999999999999993,{"$f":"IF(OR(ISNUMBER(AL13),ISNUMBER(AM13),ISNUMBER(AN13),ISNUMBER(AO13),ISNUMBER(AG13),ISNUMBER(AK13)),SUM(AL13,AM13,AN13,AO13,('TT 1'!R14*0.3),(ANNUAL!R14*0.3)),\"\")","v":47.8},{"$f":"IF(ISNUMBER('UT1'!N15),'UT1'!N15,\"\")","v":82},{"$f":"IF(ISNUMBER('UT 2'!N15),'UT 2'!N15,\"\")","v":82},{"$f":"IF(ISNUMBER('UT 3 '!N15),'UT 3 '!N15,\"\")","v":82},{"$f":"IF('TT 1'!N15>0,'TT 1'!N15,\"\")","v":82},{"$f":"IF('UT 4'!N15>0,'UT 4'!N15,\"\")","v":82},{"$f":"IF('UT 5PB1'!N15>0,'UT 5PB1'!N15,\"\")","v":82},{"$f":"IF('PREANNU PB2 '!N15>0,'PREANNU PB2 '!N15,\"\")","v":82},{"$f":"IF(ANNUAL!N15>0,ANNUAL!N15,\"\")","v":82},8.1999999999999993,8.1999999999999993,8.1999999999999993,8.1999999999999993,{"$f":"IF(OR(ISNUMBER(AY13),ISNUMBER(AZ13),ISNUMBER(BA13),ISNUMBER(BB13),ISNUMBER(AT13),ISNUMBER(AX13)),SUM(AY13,AZ13,BA13,BB13,('TT 1'!AE14*0.3),(ANNUAL!AE14*0.3)),\"\")","v":32.799999999999997},{"$f":"IF(ISNUMBER('UT1'!Q15),'UT1'!Q15,\"\")","v":82},{"$f":"IF(ISNUMBER('UT 2'!Q15),'UT 2'!Q15,\"\")","v":82},{"$f":"IF(ISNUMBER('UT 3 '!Q15),'UT 3 '!Q15,\"\")","v":82},{"$f":"IF('TT 1'!Q15>0,'TT 1'!Q15,\"\")","v":82},{"$f":"IF('UT 4'!Q15>0,'UT 4'!Q15,\"\")","v":82},{"$f":"IF('UT 5PB1'!Q15>0,'UT 5PB1'!Q15,\"\")","v":82},{"$f":"IF('PREANNU PB2 '!Q15>0,'PREANNU PB2 '!Q15,\"\")","v":82},{"$f":"IF(ANNUAL!Q15>0,ANNUAL!Q15,\"\")","v":82},8.1999999999999993,8.1999999999999993,8.1999999999999993,8.1999999999999993,{"$f":"IF(OR(ISNUMBER(BL13),ISNUMBER(BM13),ISNUMBER(BN13),ISNUMBER(BO13),ISNUMBER(BG13),ISNUMBER(BK13)),SUM(BL13,BM13,BN13,BO13,('TT 1'!AR14*0.3),(ANNUAL!AR14*0.3)),\"\")","v":32.799999999999997},{"$f":"IF(ISNUMBER('UT1'!T15),'UT1'!T15,\"\")","v":82},{"$f":"IF(ISNUMBER('UT 2'!T15),'UT 2'!T15,\"\")","v":82},{"$f":"IF(ISNUMBER('UT 3 '!T15),'UT 3 '!T15,\"\")","v":82},{"$f":"IF('TT 1'!T15>0,'TT 1'!T15,\"\")","v":82},{"$f":"IF('UT 4'!T15>0,'UT 4'!T15,\"\")","v":82},{"$f":"IF('UT 5PB1'!T15>0,'UT 5PB1'!T15,\"\")","v":82},{"$f":"IF('PREANNU PB2 '!T15>0,'PREANNU PB2 '!T15,\"\")","v":82},{"$f":"IF(ANNUAL!T15>0,ANNUAL!T15,\"\")","v":82},8.1999999999999993,8.1999999999999993,8.1999999999999993,8.1999999999999993,{"$f":"IF(OR(ISNUMBER(BY13),ISNUMBER(BZ13),ISNUMBER(CA13),ISNUMBER(CB13),ISNUMBER(BT13),ISNUMBER(BX13)),SUM(BY13,BZ13,CA13,CB13,('TT 1'!BE14*0.3),(ANNUAL!BE14*0.3)),\"\")","v":32.799999999999997},{"$f":"IF(ISNUMBER('UT1'!W15),'UT1'!W15,\"\")","v":82},{"$f":"IF(ISNUMBER('UT 2'!W15),'UT 2'!W15,\"\")","v":82},{"$f":"IF(ISNUMBER('UT 3 '!W15),'UT 3 '!W15,\"\")","v":82},{"$f":"IF('TT 1'!W15>0,'TT 1'!W15,\"\")","v":82},{"$f":"IF('UT 4'!W15>0,'UT 4'!W15,\"\")","v":82},{"$f":"IF('UT 5PB1'!W15>0,'UT 5PB1'!W15,\"\")","v":82},{"$f":"IF('PREANNU PB2 '!W15>0,'PREANNU PB2 '!W15,\"\")","v":82},{"$f":"IF(ANNUAL!W15>0,ANNUAL!W15,\"\")","v":82},8.1999999999999993,8.1999999999999993,8.1999999999999993,8.1999999999999993,{"$f":"IF(OR(ISNUMBER(CL13),ISNUMBER(CM13),ISNUMBER(CN13),ISNUMBER(CO13),ISNUMBER(CG13),ISNUMBER(CK13)),SUM(CL13,CM13,CN13,CO13,('TT 1'!BR14*0.3),(ANNUAL!BR14*0.3)),\"\")","v":32.799999999999997},41.8,58.3,47.8,32.799999999999997,32.799999999999997,32.799999999999997,32.799999999999997,279.10000000000002,{"$f":"CX13/'Student Profile'!P14","v":55.820000000000007},14]
[{"$f":"ANNUAL!A16","v":""},{"$f":"ANNUAL!B16","v":""},{"$f":"IF('Student Profile'!D15>0,'Student Profile'!D15,\"\")","v":""},{"$f":"IF(ISNUMBER('UT1'!E16),'UT1'!E16,\"\")","v":77},{"$f":"IF(ISNUMBER('UT 2'!E16),'UT 2'!E16,\"\")","v":77},{"$f":"IF(ISNUMBER('UT 3 '!E16),'UT 3 '!E16,\"\")","v":77},{"$f":"IF('TT 1'!E16>0,'TT 1'!E16,\"\")","v":52},{"$f":"IF('UT 4'!E16>0,'UT 4'!E16,\"\")","v":77},{"$f":"IF('UT 5PB1'!E16>0,'UT 5PB1'!E16,\"\")","v":77},{"$f":"IF('PREANNU PB2 '!E16>0,'PREANNU PB2 '!E16,\"\")","v":77},{"$f":"IF(ANNUAL!E16>0,ANNUAL!E16,\"\")","v":46},7.7,7.7,7.7,7.7,{"$f":"IF(OR(ISNUMBER(L14),ISNUMBER(M14),ISNUMBER(N14),ISNUMBER(O14),ISNUMBER(G14),ISNUMBER(K14)),SUM(L14,M14,N14,O14,('TT 1'!D15*0.3),(ANNUAL!D15*0.3)),\"\")","v":39.799999999999997},{"$f":"IF(ISNUMBER('UT1'!H16),'UT1'!H16,\"\")","v":46},{"$f":"IF(ISNUMBER('UT 2'!H16),'UT 2'!H16,\"\")","v":77},{"$f":"IF(ISNUMBER('UT 3 '!H16),'UT 3 '!H16,\"\")","v":77},{"$f":"IF('TT 1'!H16>0,'TT 1'!H16,\"\")","v":77},{"$f":"IF('UT 4'!H16>0,'UT 4'!H16,\"\")","v":77},{"$f":"IF('UT 5PB1'!H16>0,'UT 5PB1'!H16,\"\")","v":77},{"$f":"IF('PREANNU PB2 '!H16>0,'PREANNU PB2 '!H16,\"\")","v":77},{"$f":"IF(ANNUAL!H16>0,ANNUAL!H16,\"\")","v":77},7.7,7.7,7.7,7.7,{"$f":"IF(OR(ISNUMBER(Y14),ISNUMBER(Z14),ISNUMBER(AA14),ISNUMBER(AB14),ISNUMBER(T14),ISNUMBER(X14)),SUM(Y14,Z14,AA14,AB14,('TT 1'!E15*0.3),(ANNUAL!E15*0.3)),\"\")","v":62},{"$f":"IF(ISNUMBER('UT1'!K16),'UT1'!K16,\"\")","v":77},{"$f":"IF(ISNUMBER('UT 2'!K16),'UT 2'!K16,\"\")","v":77},{"$f":"IF(ISNUMBER('UT 3 '!K16),'UT 3 '!K16,\"\")","v":77},{"$f":"IF('TT 1'!K16>0,'TT 1'!K16,\"\")","v":77},{"$f":"IF('UT 4'!K16>0,'UT 4'!K16,\"\")","v":77},{"$f":"IF('UT 5PB1'!K16>0,'UT 5PB1'!K16,\"\")","v":77},{"$f":"IF('PREANNU PB2 '!K16>0,'PREANNU PB2 '!K16,\"\")","v":77},{"$f":"IF(ANNUAL!K16>0,ANNUAL!K16,\"\")","v":77},7.7,7.7,7.7,7.7,{"$f":"IF(OR(ISNUMBER(AL14),ISNUMBER(AM14),ISNUMBER(AN14),ISNUMBER(AO14),ISNUMBER(AG14),ISNUMBER(AK14)),SUM(AL14,AM14,AN14,AO14,('TT 1'!R15*0.3),(ANNUAL!R15*0.3)),\"\")","v":51.2},{"$f":"IF(ISNUMBER('UT1'!N16),'UT1'!N16,\"\")","v":77},{"$f":"IF(ISNUMBER('UT 2'!N16),'UT 2'!N16,\"\")","v":77},{"$f":"IF(ISNUMBER('UT 3 '!N16),'UT 3 '!N16,\"\")","v":77},{"$f":"IF('TT 1'!N16>0,'TT 1'!N16,\"\")","v":77},{"$f":"IF('UT 4'!N16>0,'UT 4'!N16,\"\")","v":77},{"$f":"IF('UT 5PB1'!N16>0,'UT 5PB1'!N16,\"\")","v":77},{"$f":"IF('PREANNU PB2 '!N16>0,'PREANNU PB2 '!N16,\"\")","v":77},{"$f":"IF(ANNUAL!N16>0,ANNUAL!N16,\"\")","v":77},7.7,7.7,7.7,7.7,{"$f":"IF(OR(ISNUMBER(AY14),ISNUMBER(AZ14),ISNUMBER(BA14),ISNUMBER(BB14),ISNUMBER(AT14),ISNUMBER(AX14)),SUM(AY14,AZ14,BA14,BB14,('TT 1'!AE15*0.3),(ANNUAL!AE15*0.3)),\"\")","v":30.8},{"$f":"IF(ISNUMBER('UT1'!Q16),'UT1'!Q16,\"\")","v":77},{"$f":"IF(ISNUMBER('UT 2'!Q16),'UT 2'!Q16,\"\")","v":77},{"$f":"IF(ISNUMBER('UT 3 '!Q16),'UT 3 '!Q16,\"\")","v":77},{"$f":"IF('TT 1'!Q16>0,'TT 1'!Q16,\"\")","v":77},{"$f":"IF('UT 4'!Q16>0,'UT 4'!Q16,\"\")","v":77},{"$f":"IF('UT 5PB1'!Q16>0,'UT 5PB1'!Q16,\"\")","v":77},{"$f":"IF('PREANNU PB2 '!Q16>0,'PREANNU PB2 '!Q16,\"\")","v":77},{"$f":"IF(ANNUAL!Q16>0,ANNUAL!Q16,\"\")","v":77},7.7,7.7,7.7,7.7,{"$f":"IF(OR(ISNUMBER(BL14),ISNUMBER(BM14),ISNUMBER(BN14),ISNUMBER(BO14),ISNUMBER(BG14),ISNUMBER(BK14)),SUM(BL14,BM14,BN14,BO14,('TT 1'!AR15*0.3),(ANNUAL!AR15*0.3)),\"\")","v":30.8},{"$f":"IF(ISNUMBER('UT1'!T16),'UT1'!T16,\"\")","v":77},{"$f":"IF(ISNUMBER('UT 2'!T16),'UT 2'!T16,\"\")","v":77},{"$f":"IF(ISNUMBER('UT 3 '!T16),'UT 3 '!T16,\"\")","v":77},{"$f":"IF('TT 1'!T16>0,'TT 1'!T16,\"\")","v":77},{"$f":"IF('UT 4'!T16>0,'UT 4'!T16,\"\")","v":77},{"$f":"IF('UT 5PB1'!T16>0,'UT 5PB1'!T16,\"\")","v":77},{"$f":"IF('PREANNU PB2 '!T16>0,'PREANNU PB2 '!T16,\"\")","v":77},{"$f":"IF(ANNUAL!T16>0,ANNUAL!T16,\"\")","v":77},7.7,7.7,7.7,7.7,{"$f":"IF(OR(ISNUMBER(BY14),ISNUMBER(BZ14),ISNUMBER(CA14),ISNUMBER(CB14),ISNUMBER(BT14),ISNUMBER(BX14)),SUM(BY14,BZ14,CA14,CB14,('TT 1'!BE15*0.3),(ANNUAL!BE15*0.3)),\"\")","v":30.8},{"$f":"IF(ISNUMBER('UT1'!W16),'UT1'!W16,\"\")","v":77},{"$f":"IF(ISNUMBER('UT 2'!W16),'UT 2'!W16,\"\")","v":77},{"$f":"IF(ISNUMBER('UT 3 '!W16),'UT 3 '!W16,\"\")","v":77},{"$f":"IF('TT 1'!W16>0,'TT 1'!W16,\"\")","v":77},{"$f":"IF('UT 4'!W16>0,'UT 4'!W16,\"\")","v":77},{"$f":"IF('UT 5PB1'!W16>0,'UT 5PB1'!W16,\"\")","v":77},{"$f":"IF('PREANNU PB2 '!W16>0,'PREANNU PB2 '!W16,\"\")","v":77},{"$f":"IF(ANNUAL!W16>0,ANNUAL!W16,\"\")","v":77},7.7,7.7,7.7,7.7,{"$f":"IF(OR(ISNUMBER(CL14),ISNUMBER(CM14),ISNUMBER(CN14),ISNUMBER(CO14),ISNUMBER(CG14),ISNUMBER(CK14)),SUM(CL14,CM14,CN14,CO14,('TT 1'!BR15*0.3),(ANNUAL!BR15*0.3)),\"\")","v":30.8},39.799999999999997,62,51.2,30.8,30.8,30.8,30.8,276.20000000000005,{"$f":"CX14/'Student Profile'!P15","v":55.240000000000009},19]
[{"$f":"ANNUAL!A17","v":""},{"$f":"ANNUAL!B17","v":""},{"$f":"IF('Student Profile'!D16>0,'Student Profile'!D16,\"\")","v":""},{"$f":"IF(ISNUMBER('UT1'!E17),'UT1'!E17,\"\")","v":74},{"$f":"IF(ISNUMBER('UT 2'!E17),'UT 2'!E17,\"\")","v":74},{"$f":"IF(ISNUMBER('UT 3 '!E17),'UT 3 '!E17,\"\")","v":74},{"$f":"IF('TT 1'!E17>0,'TT 1'!E17,\"\")","v":49},{"$f":"IF('UT 4'!E17>0,'UT 4'!E17,\"\")","v":74},{"$f":"IF('UT 5PB1'!E17>0,'UT 5PB1'!E17,\"\")","v":74},{"$f":"IF('PREANNU PB2 '!E17>0,'PREANNU PB2 '!E17,\"\")","v":74},{"$f":"IF(ANNUAL!E17>0,ANNUAL!E17,\"\")","v":44},7.4,7.4,7.4,7.4,{"$f":"IF(OR(ISNUMBER(L15),ISNUMBER(M15),ISNUMBER(N15),ISNUMBER(O15),ISNUMBER(G15),ISNUMBER(K15)),SUM(L15,M15,N15,O15,('TT 1'!D16*0.3),(ANNUAL!D16*0.3)),\"\")","v":40.4},{"$f":"IF(ISNUMBER('UT1'!H17),'UT1'!H17,\"\")","v":44},{"$f":"IF(ISNUMBER('UT 2'!H17),'UT 2'!H17,\"\")","v":74},{"$f":"IF(ISNUMBER('UT 3 '!H17),'UT 3 '!H17,\"\")","v":74},{"$f":"IF('TT 1'!H17>0,'TT 1'!H17,\"\")","v":74},{"$f":"IF('UT 4'!H17>0,'UT 4'!H17,\"\")","v":74},{"$f":"IF('UT 5PB1'!H17>0,'UT 5PB1'!H17,\"\")","v":74},{"$f":"IF('PREANNU PB2 '!H17>0,'PREANNU PB2 '!H17,\"\")","v":74},{"$f":"IF(ANNUAL!H17>0,ANNUAL!H17,\"\")","v":74},7.4,7.4,7.4,7.4,{"$f":"IF(OR(ISNUMBER(Y15),ISNUMBER(Z15),ISNUMBER(AA15),ISNUMBER(AB15),ISNUMBER(T15),ISNUMBER(X15)),SUM(Y15,Z15,AA15,AB15,('TT 1'!E16*0.3),(ANNUAL!E16*0.3)),\"\")","v":59},{"$f":"IF(ISNUMBER('UT1'!K17),'UT1'!K17,\"\")","v":74},{"$f":"IF(ISNUMBER('UT 2'!K17),'UT 2'!K17,\"\")","v":74},{"$f":"IF(ISNUMBER('UT 3 '!K17),'UT 3 '!K17,\"\")","v":74},{"$f":"IF('TT 1'!K17>0,'TT 1'!K17,\"\")","v":74},{"$f":"IF('UT 4'!K17>0,'UT 4'!K17,\"\")","v":74},{"$f":"IF('UT 5PB1'!K17>0,'UT 5PB1'!K17,\"\")","v":74},{"$f":"IF('PREANNU PB2 '!K17>0,'PREANNU PB2 '!K17,\"\")","v":74},{"$f":"IF(ANNUAL!K17>0,ANNUAL!K17,\"\")","v":74},7.4,7.4,7.4,7.4,{"$f":"IF(OR(ISNUMBER(AL15),ISNUMBER(AM15),ISNUMBER(AN15),ISNUMBER(AO15),ISNUMBER(AG15),ISNUMBER(AK15)),SUM(AL15,AM15,AN15,AO15,('TT 1'!R16*0.3),(ANNUAL!R16*0.3)),\"\")","v":46.4},{"$f":"IF(ISNUMBER('UT1'!N17),'UT1'!N17,\"\")","v":74},{"$f":"IF(ISNUMBER('UT 2'!N17),'UT 2'!N17,\"\")","v":74},{"$f":"IF(ISNUMBER('UT 3 '!N17),'UT 3 '!N17,\"\")","v":74},{"$f":"IF('TT 1'!N17>0,'TT 1'!N17,\"\")","v":74},{"$f":"IF('UT 4'!N17>0,'UT 4'!N17,\"\")","v":74},{"$f":"IF('UT 5PB1'!N17>0,'UT 5PB1'!N17,\"\")","v":74},{"$f":"IF('PREANNU PB2 '!N17>0,'PREANNU PB2 '!N17,\"\")","v":74},{"$f":"IF(ANNUAL!N17>0,ANNUAL!N17,\"\")","v":74},7.4,7.4,7.4,7.4,{"$f":"IF(OR(ISNUMBER(AY15),ISNUMBER(AZ15),ISNUMBER(BA15),ISNUMBER(BB15),ISNUMBER(AT15),ISNUMBER(AX15)),SUM(AY15,AZ15,BA15,BB15,('TT 1'!AE16*0.3),(ANNUAL!AE16*0.3)),\"\")","v":29.6},{"$f":"IF(ISNUMBER('UT1'!Q17),'UT1'!Q17,\"\")","v":74},{"$f":"IF(ISNUMBER('UT 2'!Q17),'UT 2'!Q17,\"\")","v":74},{"$f":"IF(ISNUMBER('UT 3 '!Q17),'UT 3 '!Q17,\"\")","v":74},{"$f":"IF('TT 1'!Q17>0,'TT 1'!Q17,\"\")","v":74},{"$f":"IF('UT 4'!Q17>0,'UT 4'!Q17,\"\")","v":74},{"$f":"IF('UT 5PB1'!Q17>0,'UT 5PB1'!Q17,\"\")","v":74},{"$f":"IF('PREANNU PB2 '!Q17>0,'PREANNU PB2 '!Q17,\"\")","v":74},{"$f":"IF(ANNUAL!Q17>0,ANNUAL!Q17,\"\")","v":74},7.4,7.4,7.4,7.4,{"$f":"IF(OR(ISNUMBER(BL15),ISNUMBER(BM15),ISNUMBER(BN15),ISNUMBER(BO15),ISNUMBER(BG15),ISNUMBER(BK15)),SUM(BL15,BM15,BN15,BO15,('TT 1'!AR16*0.3),(ANNUAL!AR16*0.3)),\"\")","v":29.6},{"$f":"IF(ISNUMBER('UT1'!T17),'UT1'!T17,\"\")","v":74},{"$f":"IF(ISNUMBER('UT 2'!T17),'UT 2'!T17,\"\")","v":74},{"$f":"IF(ISNUMBER('UT 3 '!T17),'UT 3 '!T17,\"\")","v":74},{"$f":"IF('TT 1'!T17>0,'TT 1'!T17,\"\")","v":74},{"$f":"IF('UT 4'!T17>0,'UT 4'!T17,\"\")","v":74},{"$f":"IF('UT 5PB1'!T17>0,'UT 5PB1'!T17,\"\")","v":74},{"$f":"IF('PREANNU PB2 '!T17>0,'PREANNU PB2 '!T17,\"\")","v":74},{"$f":"IF(ANNUAL!T17>0,ANNUAL!T17,\"\")","v":74},7.4,7.4,7.4,7.4,{"$f":"IF(OR(ISNUMBER(BY15),ISNUMBER(BZ15),ISNUMBER(CA15),ISNUMBER(CB15),ISNUMBER(BT15),ISNUMBER(BX15)),SUM(BY15,BZ15,CA15,CB15,('TT 1'!BE16*0.3),(ANNUAL!BE16*0.3)),\"\")","v":29.6},{"$f":"IF(ISNUMBER('UT1'!W17),'UT1'!W17,\"\")","v":74},{"$f":"IF(ISNUMBER('UT 2'!W17),'UT 2'!W17,\"\")","v":74},{"$f":"IF(ISNUMBER('UT 3 '!W17),'UT 3 '!W17,\"\")","v":74},{"$f":"IF('TT 1'!W17>0,'TT 1'!W17,\"\")","v":74},{"$f":"IF('UT 4'!W17>0,'UT 4'!W17,\"\")","v":74},{"$f":"IF('UT 5PB1'!W17>0,'UT 5PB1'!W17,\"\")","v":74},{"$f":"IF('PREANNU PB2 '!W17>0,'PREANNU PB2 '!W17,\"\")","v":74},{"$f":"IF(ANNUAL!W17>0,ANNUAL!W17,\"\")","v":74},7.4,7.4,7.4,7.4,{"$f":"IF(OR(ISNUMBER(CL15),ISNUMBER(CM15),ISNUMBER(CN15),ISNUMBER(CO15),ISNUMBER(CG15),ISNUMBER(CK15)),SUM(CL15,CM15,CN15,CO15,('TT 1'!BR16*0.3),(ANNUAL!BR16*0.3)),\"\")","v":29.6},40.4,59,46.4,29.6,29.6,29.6,29.6,264.2,{"$f":"CX15/'Student Profile'!P16","v":52.839999999999996},24]
[{"$f":"ANNUAL!A18","v":""},{"$f":"ANNUAL!B18","v":""},{"$f":"IF('Student Profile'!D17>0,'Student Profile'!D17,\"\")","v":""},{"$f":"IF(ISNUMBER('UT1'!E18),'UT1'!E18,\"\")","v":50},{"$f":"IF(ISNUMBER('UT 2'!E18),'UT 2'!E18,\"\")","v":50},{"$f":"IF(ISNUMBER('UT 3 '!E18),'UT 3 '!E18,\"\")","v":50},{"$f":"IF('TT 1'!E18>0,'TT 1'!E18,\"\")","v":34},{"$f":"IF('UT 4'!E18>0,'UT 4'!E18,\"\")","v":50},{"$f":"IF('UT 5PB1'!E18>0,'UT 5PB1'!E18,\"\")","v":50},{"$f":"IF('PREANNU PB2 '!E18>0,'PREANNU PB2 '!E18,\"\")","v":50},{"$f":"IF(ANNUAL!E18>0,ANNUAL!E18,\"\")","v":30},5,5,5,5,{"$f":"IF(OR(ISNUMBER(L16),ISNUMBER(M16),ISNUMBER(N16),ISNUMBER(O16),ISNUMBER(G16),ISNUMBER(K16)),SUM(L16,M16,N16,O16,('TT 1'!D17*0.3),(ANNUAL!D17*0.3)),\"\")","v":29},{"$f":"IF(ISNUMBER('UT1'!H18),'UT1'!H18,\"\")","v":30},{"$f":"IF(ISNUMBER('UT 2'!H18),'UT 2'!H18,\"\")","v":50},{"$f":"IF(ISNUMBER('UT 3 '!H18),'UT 3 '!H18,\"\")","v":50},{"$f":"IF('TT 1'!H18>0,'TT 1'!H18,\"\")","v":50},{"$f":"IF('UT 4'!H18>0,'UT 4'!H18,\"\")","v":50},{"$f":"IF('UT 5PB1'!H18>0,'UT 5PB1'!H18,\"\")","v":50},{"$f":"IF('PREANNU PB2 '!H18>0,'PREANNU PB2 '!H18,\"\")","v":50},{"$f":"IF(ANNUAL!H18>0,ANNUAL!H18,\"\")","v":50},5,5,5,5,{"$f":"IF(OR(ISNUMBER(Y16),ISNUMBER(Z16),ISNUMBER(AA16),ISNUMBER(AB16),ISNUMBER(T16),ISNUMBER(X16)),SUM(Y16,Z16,AA16,AB16,('TT 1'!E17*0.3),(ANNUAL!E17*0.3)),\"\")","v":47.900000000000006},{"$f":"IF(ISNUMBER('UT1'!K18),'UT1'!K18,\"\")","v":50},{"$f":"IF(ISNUMBER('UT 2'!K18),'UT 2'!K18,\"\")","v":50},{"$f":"IF(ISNUMBER('UT 3 '!K18),'UT 3 '!K18,\"\")","v":50},{"$f":"IF('TT 1'!K18>0,'TT 1'!K18,\"\")","v":50},{"$f":"IF('UT 4'!K18>0,'UT 4'!K18,\"\")","v":50},{"$f":"IF('UT 5PB1'!K18>0,'UT 5PB1'!K18,\"\")","v":50},{"$f":"IF('PREANNU PB2 '!K18>0,'PREANNU PB2 '!K18,\"\")","v":50},{"$f":"IF(ANNUAL!K18>0,ANNUAL!K18,\"\")","v":50},5,5,5,5,{"$f":"IF(OR(ISNUMBER(AL16),ISNUMBER(AM16),ISNUMBER(AN16),ISNUMBER(AO16),ISNUMBER(AG16),ISNUMBER(AK16)),SUM(AL16,AM16,AN16,AO16,('TT 1'!R17*0.3),(ANNUAL!R17*0.3)),\"\")","v":37.4},{"$f":"IF(ISNUMBER('UT1'!N18),'UT1'!N18,\"\")","v":50},{"$f":"IF(ISNUMBER('UT 2'!N18),'UT 2'!N18,\"\")","v":50},{"$f":"IF(ISNUMBER('UT 3 '!N18),'UT 3 '!N18,\"\")","v":50},{"$f":"IF('TT 1'!N18>0,'TT 1'!N18,\"\")","v":50},{"$f":"IF('UT 4'!N18>0,'UT 4'!N18,\"\")","v":50},{"$f":"IF('UT 5PB1'!N18>0,'UT 5PB1'!N18,\"\")","v":50},{"$f":"IF('PREANNU PB2 '!N18>0,'PREANNU PB2 '!N18,\"\")","v":50},{"$f":"IF(ANNUAL!N18>0,ANNUAL!N18,\"\")","v":50},5,5,5,5,{"$f":"IF(OR(ISNUMBER(AY16),ISNUMBER(AZ16),ISNUMBER(BA16),ISNUMBER(BB16),ISNUMBER(AT16),ISNUMBER(AX16)),SUM(AY16,AZ16,BA16,BB16,('TT 1'!AE17*0.3),(ANNUAL!AE17*0.3)),\"\")","v":20},{"$f":"IF(ISNUMBER('UT1'!Q18),'UT1'!Q18,\"\")","v":50},{"$f":"IF(ISNUMBER('UT 2'!Q18),'UT 2'!Q18,\"\")","v":50},{"$f":"IF(ISNUMBER('UT 3 '!Q18),'UT 3 '!Q18,\"\")","v":50},{"$f":"IF('TT 1'!Q18>0,'TT 1'!Q18,\"\")","v":50},{"$f":"IF('UT 4'!Q18>0,'UT 4'!Q18,\"\")","v":50},{"$f":"IF('UT 5PB1'!Q18>0,'UT 5PB1'!Q18,\"\")","v":50},{"$f":"IF('PREANNU PB2 '!Q18>0,'PREANNU PB2 '!Q18,\"\")","v":50},{"$f":"IF(ANNUAL!Q18>0,ANNUAL!Q18,\"\")","v":50},5,5,5,5,{"$f":"IF(OR(ISNUMBER(BL16),ISNUMBER(BM16),ISNUMBER(BN16),ISNUMBER(BO16),ISNUMBER(BG16),ISNUMBER(BK16)),SUM(BL16,BM16,BN16,BO16,('TT 1'!AR17*0.3),(ANNUAL!AR17*0.3)),\"\")","v":20},{"$f":"IF(ISNUMBER('UT1'!T18),'UT1'!T18,\"\")","v":50},{"$f":"IF(ISNUMBER('UT 2'!T18),'UT 2'!T18,\"\")","v":50},{"$f":"IF(ISNUMBER('UT 3 '!T18),'UT 3 '!T18,\"\")","v":50},{"$f":"IF('TT 1'!T18>0,'TT 1'!T18,\"\")","v":50},{"$f":"IF('UT 4'!T18>0,'UT 4'!T18,\"\")","v":50},{"$f":"IF('UT 5PB1'!T18>0,'UT 5PB1'!T18,\"\")","v":50},{"$f":"IF('PREANNU PB2 '!T18>0,'PREANNU PB2 '!T18,\"\")","v":50},{"$f":"IF(ANNUAL!T18>0,ANNUAL!T18,\"\")","v":50},5,5,5,5,{"$f":"IF(OR(ISNUMBER(BY16),ISNUMBER(BZ16),ISNUMBER(CA16),ISNUMBER(CB16),ISNUMBER(BT16),ISNUMBER(BX16)),SUM(BY16,BZ16,CA16,CB16,('TT 1'!BE17*0.3),(ANNUAL!BE17*0.3)),\"\")","v":20},{"$f":"IF(ISNUMBER('UT1'!W18),'UT1'!W18,\"\")","v":50},{"$f":"IF(ISNUMBER('UT 2'!W18),'UT 2'!W18,\"\")","v":50},{"$f":"IF(ISNUMBER('UT 3 '!W18),'UT 3 '!W18,\"\")","v":50},{"$f":"IF('TT 1'!W18>0,'TT 1'!W18,\"\")","v":50},{"$f":"IF('UT 4'!W18>0,'UT 4'!W18,\"\")","v":50},{"$f":"IF('UT 5PB1'!W18>0,'UT 5PB1'!W18,\"\")","v":50},{"$f":"IF('PREANNU PB2 '!W18>0,'PREANNU PB2 '!W18,\"\")","v":50},{"$f":"IF(ANNUAL!W18>0,ANNUAL!W18,\"\")","v":50},5,5,5,5,{"$f":"IF(OR(ISNUMBER(CL16),ISNUMBER(CM16),ISNUMBER(CN16),ISNUMBER(CO16),ISNUMBER(CG16),ISNUMBER(CK16)),SUM(CL16,CM16,CN16,CO16,('TT 1'!BR17*0.3),(ANNUAL!BR17*0.3)),\"\")","v":20},29,47.900000000000006,37.4,20,20,20,20,194.3,{"$f":"CX16/'Student Profile'!P17","v":38.86},42]
[{"$f":"ANNUAL!A19","v":""},{"$f":"ANNUAL!B19","v":""},{"$f":"IF('Student Profile'!D18>0,'Student Profile'!D18,\"\")","v":""},{"$f":"IF(ISNUMBER('UT1'!E19),'UT1'!E19,\"\")","v":67},{"$f":"IF(ISNUMBER('UT 2'!E19),'UT 2'!E19,\"\")","v":67},{"$f":"IF(ISNUMBER('UT 3 '!E19),'UT 3 '!E19,\"\")","v":67},{"$f":"IF('TT 1'!E19>0,'TT 1'!E19,\"\")","v":45},{"$f":"IF('UT 4'!E19>0,'UT 4'!E19,\"\")","v":67},{"$f":"IF('UT 5PB1'!E19>0,'UT 5PB1'!E19,\"\")","v":67},{"$f":"IF('PREANNU PB2 '!E19>0,'PREANNU PB2 '!E19,\"\")","v":67},{"$f":"IF(ANNUAL!E19>0,ANNUAL!E19,\"\")","v":40},6.7,6.7,6.7,6.7,{"$f":"IF(OR(ISNUMBER(L17),ISNUMBER(M17),ISNUMBER(N17),ISNUMBER(O17),ISNUMBER(G17),ISNUMBER(K17)),SUM(L17,M17,N17,O17,('TT 1'!D18*0.3),(ANNUAL!D18*0.3)),\"\")","v":32.799999999999997},{"$f":"IF(ISNUMBER('UT1'!H19),'UT1'!H19,\"\")","v":40},{"$f":"IF(ISNUMBER('UT 2'!H19),'UT 2'!H19,\"\")","v":67},{"$f":"IF(ISNUMBER('UT 3 '!H19),'UT 3 '!H19,\"\")","v":67},{"$f":"IF('TT 1'!H19>0,'TT 1'!H19,\"\")","v":67},{"$f":"IF('UT 4'!H19>0,'UT 4'!H19,\"\")","v":67},{"$f":"IF('UT 5PB1'!H19>0,'UT 5PB1'!H19,\"\")","v":67},{"$f":"IF('PREANNU PB2 '!H19>0,'PREANNU PB2 '!H19,\"\")","v":67},{"$f":"IF(ANNUAL!H19>0,ANNUAL!H19,\"\")","v":67},6.7,6.7,6.7,6.7,{"$f":"IF(OR(ISNUMBER(Y17),ISNUMBER(Z17),ISNUMBER(AA17),ISNUMBER(AB17),ISNUMBER(T17),ISNUMBER(X17)),SUM(Y17,Z17,AA17,AB17,('TT 1'!E18*0.3),(ANNUAL!E18*0.3)),\"\")","v":46},{"$f":"IF(ISNUMBER('UT1'!K19),'UT1'!K19,\"\")","v":67},{"$f":"IF(ISNUMBER('UT 2'!K19),'UT 2'!K19,\"\")","v":67},{"$f":"IF(ISNUMBER('UT 3 '!K19),'UT 3 '!K19,\"\")","v":67},{"$f":"IF('TT 1'!K19>0,'TT 1'!K19,\"\")","v":67},{"$f":"IF('UT 4'!K19>0,'UT 4'!K19,\"\")","v":67},{"$f":"IF('UT 5PB1'!K19>0,'UT 5PB1'!K19,\"\")","v":67},{"$f":"IF('PREANNU PB2 '!K19>0,'PREANNU PB2 '!K19,\"\")","v":67},{"$f":"IF(ANNUAL!K19>0,ANNUAL!K19,\"\")","v":67},6.7,6.7,6.7,6.7,{"$f":"IF(OR(ISNUMBER(AL17),ISNUMBER(AM17),ISNUMBER(AN17),ISNUMBER(AO17),ISNUMBER(AG17),ISNUMBER(AK17)),SUM(AL17,AM17,AN17,AO17,('TT 1'!R18*0.3),(ANNUAL!R18*0.3)),\"\")","v":38.799999999999997},{"$f":"IF(ISNUMBER('UT1'!N19),'UT1'!N19,\"\")","v":67},{"$f":"IF(ISNUMBER('UT 2'!N19),'UT 2'!N19,\"\")","v":67},{"$f":"IF(ISNUMBER('UT 3 '!N19),'UT 3 '!N19,\"\")","v":67},{"$f":"IF('TT 1'!N19>0,'TT 1'!N19,\"\")","v":67},{"$f":"IF('UT 4'!N19>0,'UT 4'!N19,\"\")","v":67},{"$f":"IF('UT 5PB1'!N19>0,'UT 5PB1'!N19,\"\")","v":67},{"$f":"IF('PREANNU PB2 '!N19>0,'PREANNU PB2 '!N19,\"\")","v":67},{"$f":"IF(ANNUAL!N19>0,ANNUAL!N19,\"\")","v":67},6.7,6.7,6.7,6.7,{"$f":"IF(OR(ISNUMBER(AY17),ISNUMBER(AZ17),ISNUMBER(BA17),ISNUMBER(BB17),ISNUMBER(AT17),ISNUMBER(AX17)),SUM(AY17,AZ17,BA17,BB17,('TT 1'!AE18*0.3),(ANNUAL!AE18*0.3)),\"\")","v":26.8},{"$f":"IF(ISNUMBER('UT1'!Q19),'UT1'!Q19,\"\")","v":67},{"$f":"IF(ISNUMBER('UT 2'!Q19),'UT 2'!Q19,\"\")","v":67},{"$f":"IF(ISNUMBER('UT 3 '!Q19),'UT 3 '!Q19,\"\")","v":67},{"$f":"IF('TT 1'!Q19>0,'TT 1'!Q19,\"\")","v":67},{"$f":"IF('UT 4'!Q19>0,'UT 4'!Q19,\"\")","v":67},{"$f":"IF('UT 5PB1'!Q19>0,'UT 5PB1'!Q19,\"\")","v":67},{"$f":"IF('PREANNU PB2 '!Q19>0,'PREANNU PB2 '!Q19,\"\")","v":67},{"$f":"IF(ANNUAL!Q19>0,ANNUAL!Q19,\"\")","v":67},6.7,6.7,6.7,6.7,{"$f":"IF(OR(ISNUMBER(BL17),ISNUMBER(BM17),ISNUMBER(BN17),ISNUMBER(BO17),ISNUMBER(BG17),ISNUMBER(BK17)),SUM(BL17,BM17,BN17,BO17,('TT 1'!AR18*0.3),(ANNUAL!AR18*0.3)),\"\")","v":26.8},{"$f":"IF(ISNUMBER('UT1'!T19),'UT1'!T19,\"\")","v":67},{"$f":"IF(ISNUMBER('UT 2'!T19),'UT 2'!T19,\"\")","v":67},{"$f":"IF(ISNUMBER('UT 3 '!T19),'UT 3 '!T19,\"\")","v":67},{"$f":"IF('TT 1'!T19>0,'TT 1'!T19,\"\")","v":67},{"$f":"IF('UT 4'!T19>0,'UT 4'!T19,\"\")","v":67},{"$f":"IF('UT 5PB1'!T19>0,'UT 5PB1'!T19,\"\")","v":67},{"$f":"IF('PREANNU PB2 '!T19>0,'PREANNU PB2 '!T19,\"\")","v":67},{"$f":"IF(ANNUAL!T19>0,ANNUAL!T19,\"\")","v":67},6.7,6.7,6.7,6.7,{"$f":"IF(OR(ISNUMBER(BY17),ISNUMBER(BZ17),ISNUMBER(CA17),ISNUMBER(CB17),ISNUMBER(BT17),ISNUMBER(BX17)),SUM(BY17,BZ17,CA17,CB17,('TT 1'!BE18*0.3),(ANNUAL!BE18*0.3)),\"\")","v":26.8},{"$f":"IF(ISNUMBER('UT1'!W19),'UT1'!W19,\"\")","v":67},{"$f":"IF(ISNUMBER('UT 2'!W19),'UT 2'!W19,\"\")","v":67},{"$f":"IF(ISNUMBER('UT 3 '!W19),'UT 3 '!W19,\"\")","v":67},{"$f":"IF('TT 1'!W19>0,'TT 1'!W19,\"\")","v":67},{"$f":"IF('UT 4'!W19>0,'UT 4'!W19,\"\")","v":67},{"$f":"IF('UT 5PB1'!W19>0,'UT 5PB1'!W19,\"\")","v":67},{"$f":"IF('PREANNU PB2 '!W19>0,'PREANNU PB2 '!W19,\"\")","v":67},{"$f":"IF(ANNUAL!W19>0,ANNUAL!W19,\"\")","v":67},6.7,6.7,6.7,6.7,{"$f":"IF(OR(ISNUMBER(CL17),ISNUMBER(CM17),ISNUMBER(CN17),ISNUMBER(CO17),ISNUMBER(CG17),ISNUMBER(CK17)),SUM(CL17,CM17,CN17,CO17,('TT 1'!BR18*0.3),(ANNUAL!BR18*0.3)),\"\")","v":26.8},32.799999999999997,46,38.799999999999997,26.8,26.8,26.8,26.8,224.80000000000004,{"$f":"CX17/'Student Profile'!P18","v":44.960000000000008},38]
[{"$f":"ANNUAL!A20","v":""},{"$f":"ANNUAL!B20","v":""},{"$f":"IF('Student Profile'!D19>0,'Student Profile'!D19,\"\")","v":""},{"$f":"IF(ISNUMBER('UT1'!E20),'UT1'!E20,\"\")","v":92},{"$f":"IF(ISNUMBER('UT 2'!E20),'UT 2'!E20,\"\")","v":92},{"$f":"IF(ISNUMBER('UT 3 '!E20),'UT 3 '!E20,\"\")","v":92},{"$f":"IF('TT 1'!E20>0,'TT 1'!E20,\"\")","v":62},{"$f":"IF('UT 4'!E20>0,'UT 4'!E20,\"\")","v":92},{"$f":"IF('UT 5PB1'!E20>0,'UT 5PB1'!E20,\"\")","v":92},{"$f":"IF('PREANNU PB2 '!E20>0,'PREANNU PB2 '!E20,\"\")","v":92},{"$f":"IF(ANNUAL!E20>0,ANNUAL!E20,\"\")","v":55},9.1999999999999993,9.1999999999999993,9.1999999999999993,9.1999999999999993,{"$f":"IF(OR(ISNUMBER(L18),ISNUMBER(M18),ISNUMBER(N18),ISNUMBER(O18),ISNUMBER(G18),ISNUMBER(K18)),SUM(L18,M18,N18,O18,('TT 1'!D19*0.3),(ANNUAL!D19*0.3)),\"\")","v":45.8},{"$f":"IF(ISNUMBER('UT1'!H20),'UT1'!H20,\"\")","v":55},{"$f":"IF(ISNUMBER('UT 2'!H20),'UT 2'!H20,\"\")","v":92},{"$f":"IF(ISNUMBER('UT 3 '!H20),'UT 3 '!H20,\"\")","v":92},{"$f":"IF('TT 1'!H20>0,'TT 1'!H20,\"\")","v":92},{"$f":"IF('UT 4'!H20>0,'UT 4'!H20,\"\")","v":92},{"$f":"IF('UT 5PB1'!H20>0,'UT 5PB1'!H20,\"\")","v":92},{"$f":"IF('PREANNU PB2 '!H20>0,'PREANNU PB2 '!H20,\"\")","v":92},{"$f":"IF(ANNUAL!H20>0,ANNUAL!H20,\"\")","v":92},9.1999999999999993,9.1999999999999993,9.1999999999999993,9.1999999999999993,{"$f":"IF(OR(ISNUMBER(Y18),ISNUMBER(Z18),ISNUMBER(AA18),ISNUMBER(AB18),ISNUMBER(T18),ISNUMBER(X18)),SUM(Y18,Z18,AA18,AB18,('TT 1'!E19*0.3),(ANNUAL!E19*0.3)),\"\")","v":62.3},{"$f":"IF(ISNUMBER('UT1'!K20),'UT1'!K20,\"\")","v":92},{"$f":"IF(ISNUMBER('UT 2'!K20),'UT 2'!K20,\"\")","v":92},{"$f":"IF(ISNUMBER('UT 3 '!K20),'UT 3 '!K20,\"\")","v":92},{"$f":"IF('TT 1'!K20>0,'TT 1'!K20,\"\")","v":92},{"$f":"IF('UT 4'!K20>0,'UT 4'!K20,\"\")","v":92},{"$f":"IF('UT 5PB1'!K20>0,'UT 5PB1'!K20,\"\")","v":92},{"$f":"IF('PREANNU PB2 '!K20>0,'PREANNU PB2 '!K20,\"\")","v":92},{"$f":"IF(ANNUAL!K20>0,ANNUAL!K20,\"\")","v":92},9.1999999999999993,9.1999999999999993,9.1999999999999993,9.1999999999999993,{"$f":"IF(OR(ISNUMBER(AL18),ISNUMBER(AM18),ISNUMBER(AN18),ISNUMBER(AO18),ISNUMBER(AG18),ISNUMBER(AK18)),SUM(AL18,AM18,AN18,AO18,('TT 1'!R19*0.3),(ANNUAL!R19*0.3)),\"\")","v":51.8},{"$f":"IF(ISNUMBER('UT1'!N20),'UT1'!N20,\"\")","v":92},{"$f":"IF(ISNUMBER('UT 2'!N20),'UT 2'!N20,\"\")","v":92},{"$f":"IF(ISNUMBER('UT 3 '!N20),'UT 3 '!N20,\"\")","v":92},{"$f":"IF('TT 1'!N20>0,'TT 1'!N20,\"\")","v":92},{"$f":"IF('UT 4'!N20>0,'UT 4'!N20,\"\")","v":92},{"$f":"IF('UT 5PB1'!N20>0,'UT 5PB1'!N20,\"\")","v":92},{"$f":"IF('PREANNU PB2 '!N20>0,'PREANNU PB2 '!N20,\"\")","v":92},{"$f":"IF(ANNUAL!N20>0,ANNUAL!N20,\"\")","v":92},9.1999999999999993,9.1999999999999993,9.1999999999999993,9.1999999999999993,{"$f":"IF(OR(ISNUMBER(AY18),ISNUMBER(AZ18),ISNUMBER(BA18),ISNUMBER(BB18),ISNUMBER(AT18),ISNUMBER(AX18)),SUM(AY18,AZ18,BA18,BB18,('TT 1'!AE19*0.3),(ANNUAL!AE19*0.3)),\"\")","v":36.799999999999997},{"$f":"IF(ISNUMBER('UT1'!Q20),'UT1'!Q20,\"\")","v":92},{"$f":"IF(ISNUMBER('UT 2'!Q20),'UT 2'!Q20,\"\")","v":92},{"$f":"IF(ISNUMBER('UT 3 '!Q20),'UT 3 '!Q20,\"\")","v":92},{"$f":"IF('TT 1'!Q20>0,'TT 1'!Q20,\"\")","v":92},{"$f":"IF('UT 4'!Q20>0,'UT 4'!Q20,\"\")","v":92},{"$f":"IF('UT 5PB1'!Q20>0,'UT 5PB1'!Q20,\"\")","v":92},{"$f":"IF('PREANNU PB2 '!Q20>0,'PREANNU PB2 '!Q20,\"\")","v":92},{"$f":"IF(ANNUAL!Q20>0,ANNUAL!Q20,\"\")","v":92},9.1999999999999993,9.1999999999999993,9.1999999999999993,9.1999999999999993,{"$f":"IF(OR(ISNUMBER(BL18),ISNUMBER(BM18),ISNUMBER(BN18),ISNUMBER(BO18),ISNUMBER(BG18),ISNUMBER(BK18)),SUM(BL18,BM18,BN18,BO18,('TT 1'!AR19*0.3),(ANNUAL!AR19*0.3)),\"\")","v":36.799999999999997},{"$f":"IF(ISNUMBER('UT1'!T20),'UT1'!T20,\"\")","v":92},{"$f":"IF(ISNUMBER('UT 2'!T20),'UT 2'!T20,\"\")","v":92},{"$f":"IF(ISNUMBER('UT 3 '!T20),'UT 3 '!T20,\"\")","v":92},{"$f":"IF('TT 1'!T20>0,'TT 1'!T20,\"\")","v":92},{"$f":"IF('UT 4'!T20>0,'UT 4'!T20,\"\")","v":92},{"$f":"IF('UT 5PB1'!T20>0,'UT 5PB1'!T20,\"\")","v":92},{"$f":"IF('PREANNU PB2 '!T20>0,'PREANNU PB2 '!T20,\"\")","v":92},{"$f":"IF(ANNUAL!T20>0,ANNUAL!T20,\"\")","v":92},9.1999999999999993,9.1999999999999993,9.1999999999999993,9.1999999999999993,{"$f":"IF(OR(ISNUMBER(BY18),ISNUMBER(BZ18),ISNUMBER(CA18),ISNUMBER(CB18),ISNUMBER(BT18),ISNUMBER(BX18)),SUM(BY18,BZ18,CA18,CB18,('TT 1'!BE19*0.3),(ANNUAL!BE19*0.3)),\"\")","v":36.799999999999997},{"$f":"IF(ISNUMBER('UT1'!W20),'UT1'!W20,\"\")","v":92},{"$f":"IF(ISNUMBER('UT 2'!W20),'UT 2'!W20,\"\")","v":92},{"$f":"IF(ISNUMBER('UT 3 '!W20),'UT 3 '!W20,\"\")","v":92},{"$f":"IF('TT 1'!W20>0,'TT 1'!W20,\"\")","v":92},{"$f":"IF('UT 4'!W20>0,'UT 4'!W20,\"\")","v":92},{"$f":"IF('UT 5PB1'!W20>0,'UT 5PB1'!W20,\"\")","v":92},{"$f":"IF('PREANNU PB2 '!W20>0,'PREANNU PB2 '!W20,\"\")","v":92},{"$f":"IF(ANNUAL!W20>0,ANNUAL!W20,\"\")","v":92},9.1999999999999993,9.1999999999999993,9.1999999999999993,9.1999999999999993,{"$f":"IF(OR(ISNUMBER(CL18),ISNUMBER(CM18),ISNUMBER(CN18),ISNUMBER(CO18),ISNUMBER(CG18),ISNUMBER(CK18)),SUM(CL18,CM18,CN18,CO18,('TT 1'!BR19*0.3),(ANNUAL!BR19*0.3)),\"\")","v":36.799999999999997},45.8,62.3,51.8,36.799999999999997,36.799999999999997,36.799999999999997,36.799999999999997,307.10000000000002,{"$f":"CX18/'Student Profile'!P19","v":61.42},1]
[{"$f":"ANNUAL!A21","v":""},{"$f":"ANNUAL!B21","v":""},{"$f":"IF('Student Profile'!D20>0,'Student Profile'!D20,\"\")","v":""},{"$f":"IF(ISNUMBER('UT1'!E21),'UT1'!E21,\"\")","v":70},{"$f":"IF(ISNUMBER('UT 2'!E21),'UT 2'!E21,\"\")","v":70},{"$f":"IF(ISNUMBER('UT 3 '!E21),'UT 3 '!E21,\"\")","v":70},{"$f":"IF('TT 1'!E21>0,'TT 1'!E21,\"\")","v":47},{"$f":"IF('UT 4'!E21>0,'UT 4'!E21,\"\")","v":70},{"$f":"IF('UT 5PB1'!E21>0,'UT 5PB1'!E21,\"\")","v":70},{"$f":"IF('PREANNU PB2 '!E21>0,'PREANNU PB2 '!E21,\"\")","v":70},{"$f":"IF(ANNUAL!E21>0,ANNUAL!E21,\"\")","v":42},7,7,7,7,{"$f":"IF(OR(ISNUMBER(L19),ISNUMBER(M19),ISNUMBER(N19),ISNUMBER(O19),ISNUMBER(G19),ISNUMBER(K19)),SUM(L19,M19,N19,O19,('TT 1'!D20*0.3),(ANNUAL!D20*0.3)),\"\")","v":40},{"$f":"IF(ISNUMBER('UT1'!H21),'UT1'!H21,\"\")","v":42},{"$f":"IF(ISNUMBER('UT 2'!H21),'UT 2'!H21,\"\")","v":70},{"$f":"IF(ISNUMBER('UT 3 '!H21),'UT 3 '!H21,\"\")","v":70},{"$f":"IF('TT 1'!H21>0,'TT 1'!H21,\"\")","v":70},{"$f":"IF('UT 4'!H21>0,'UT 4'!H21,\"\")","v":70},{"$f":"IF('UT 5PB1'!H21>0,'UT 5PB1'!H21,\"\")","v":70},{"$f":"IF('PREANNU PB2 '!H21>0,'PREANNU PB2 '!H21,\"\")","v":70},{"$f":"IF(ANNUAL!H21>0,ANNUAL!H21,\"\")","v":70},7,7,7,7,{"$f":"IF(OR(ISNUMBER(Y19),ISNUMBER(Z19),ISNUMBER(AA19),ISNUMBER(AB19),ISNUMBER(T19),ISNUMBER(X19)),SUM(Y19,Z19,AA19,AB19,('TT 1'!E20*0.3),(ANNUAL!E20*0.3)),\"\")","v":63.099999999999994},{"$f":"IF(ISNUMBER('UT1'!K21),'UT1'!K21,\"\")","v":70},{"$f":"IF(ISNUMBER('UT 2'!K21),'UT 2'!K21,\"\")","v":70},{"$f":"IF(ISNUMBER('UT 3 '!K21),'UT 3 '!K21,\"\")","v":70},{"$f":"IF('TT 1'!K21>0,'TT 1'!K21,\"\")","v":70},{"$f":"IF('UT 4'!K21>0,'UT 4'!K21,\"\")","v":70},{"$f":"IF('UT 5PB1'!K21>0,'UT 5PB1'!K21,\"\")","v":70},{"$f":"IF('PREANNU PB2 '!K21>0,'PREANNU PB2 '!K21,\"\")","v":70},{"$f":"IF(ANNUAL!K21>0,ANNUAL!K21,\"\")","v":70},7,7,7,7,{"$f":"IF(OR(ISNUMBER(AL19),ISNUMBER(AM19),ISNUMBER(AN19),ISNUMBER(AO19),ISNUMBER(AG19),ISNUMBER(AK19)),SUM(AL19,AM19,AN19,AO19,('TT 1'!R20*0.3),(ANNUAL!R20*0.3)),\"\")","v":49},{"$f":"IF(ISNUMBER('UT1'!N21),'UT1'!N21,\"\")","v":70},{"$f":"IF(ISNUMBER('UT 2'!N21),'UT 2'!N21,\"\")","v":70},{"$f":"IF(ISNUMBER('UT 3 '!N21),'UT 3 '!N21,\"\")","v":70},{"$f":"IF('TT 1'!N21>0,'TT 1'!N21,\"\")","v":70},{"$f":"IF('UT 4'!N21>0,'UT 4'!N21,\"\")","v":70},{"$f":"IF('UT 5PB1'!N21>0,'UT 5PB1'!N21,\"\")","v":70},{"$f":"IF('PREANNU PB2 '!N21>0,'PREANNU PB2 '!N21,\"\")","v":70},{"$f":"IF(ANNUAL!N21>0,ANNUAL!N21,\"\")","v":70},7,7,7,7,{"$f":"IF(OR(ISNUMBER(AY19),ISNUMBER(AZ19),ISNUMBER(BA19),ISNUMBER(BB19),ISNUMBER(AT19),ISNUMBER(AX19)),SUM(AY19,AZ19,BA19,BB19,('TT 1'!AE20*0.3),(ANNUAL!AE20*0.3)),\"\")","v":28},{"$f":"IF(ISNUMBER('UT1'!Q21),'UT1'!Q21,\"\")","v":70},{"$f":"IF(ISNUMBER('UT 2'!Q21),'UT 2'!Q21,\"\")","v":70},{"$f":"IF(ISNUMBER('UT 3 '!Q21),'UT 3 '!Q21,\"\")","v":70},{"$f":"IF('TT 1'!Q21>0,'TT 1'!Q21,\"\")","v":70},{"$f":"IF('UT 4'!Q21>0,'UT 4'!Q21,\"\")","v":70},{"$f":"IF('UT 5PB1'!Q21>0,'UT 5PB1'!Q21,\"\")","v":70},{"$f":"IF('PREANNU PB2 '!Q21>0,'PREANNU PB2 '!Q21,\"\")","v":70},{"$f":"IF(ANNUAL!Q21>0,ANNUAL!Q21,\"\")","v":70},7,7,7,7,{"$f":"IF(OR(ISNUMBER(BL19),ISNUMBER(BM19),ISNUMBER(BN19),ISNUMBER(BO19),ISNUMBER(BG19),ISNUMBER(BK19)),SUM(BL19,BM19,BN19,BO19,('TT 1'!AR20*0.3),(ANNUAL!AR20*0.3)),\"\")","v":28},{"$f":"IF(ISNUMBER('UT1'!T21),'UT1'!T21,\"\")","v":70},{"$f":"IF(ISNUMBER('UT 2'!T21),'UT 2'!T21,\"\")","v":70},{"$f":"IF(ISNUMBER('UT 3 '!T21),'UT 3 '!T21,\"\")","v":70},{"$f":"IF('TT 1'!T21>0,'TT 1'!T21,\"\")","v":70},{"$f":"IF('UT 4'!T21>0,'UT 4'!T21,\"\")","v":70},{"$f":"IF('UT 5PB1'!T21>0,'UT 5PB1'!T21,\"\")","v":70},{"$f":"IF('PREANNU PB2 '!T21>0,'PREANNU PB2 '!T21,\"\")","v":70},{"$f":"IF(ANNUAL!T21>0,ANNUAL!T21,\"\")","v":70},7,7,7,7,{"$f":"IF(OR(ISNUMBER(BY19),ISNUMBER(BZ19),ISNUMBER(CA19),ISNUMBER(CB19),ISNUMBER(BT19),ISNUMBER(BX19)),SUM(BY19,BZ19,CA19,CB19,('TT 1'!BE20*0.3),(ANNUAL!BE20*0.3)),\"\")","v":28},{"$f":"IF(ISNUMBER('UT1'!W21),'UT1'!W21,\"\")","v":70},{"$f":"IF(ISNUMBER('UT 2'!W21),'UT 2'!W21,\"\")","v":70},{"$f":"IF(ISNUMBER('UT 3 '!W21),'UT 3 '!W21,\"\")","v":70},{"$f":"IF('TT 1'!W21>0,'TT 1'!W21,\"\")","v":70},{"$f":"IF('UT 4'!W21>0,'UT 4'!W21,\"\")","v":70},{"$f":"IF('UT 5PB1'!W21>0,'UT 5PB1'!W21,\"\")","v":70},{"$f":"IF('PREANNU PB2 '!W21>0,'PREANNU PB2 '!W21,\"\")","v":70},{"$f":"IF(ANNUAL!W21>0,ANNUAL!W21,\"\")","v":70},7,7,7,7,{"$f":"IF(OR(ISNUMBER(CL19),ISNUMBER(CM19),ISNUMBER(CN19),ISNUMBER(CO19),ISNUMBER(CG19),ISNUMBER(CK19)),SUM(CL19,CM19,CN19,CO19,('TT 1'!BR20*0.3),(ANNUAL!BR20*0.3)),\"\")","v":28},40,63.099999999999994,49,28,28,28,28,264.10000000000002,{"$f":"CX19/'Student Profile'!P20","v":52.820000000000007},28]
[{"$f":"ANNUAL!A22","v":""},{"$f":"ANNUAL!B22","v":""},{"$f":"IF('Student Profile'!D21>0,'Student Profile'!D21,\"\")","v":""},{"$f":"IF(ISNUMBER('UT1'!E22),'UT1'!E22,\"\")","v":82},{"$f":"IF(ISNUMBER('UT 2'!E22),'UT 2'!E22,\"\")","v":82},{"$f":"IF(ISNUMBER('UT 3 '!E22),'UT 3 '!E22,\"\")","v":82},{"$f":"IF('TT 1'!E22>0,'TT 1'!E22,\"\")","v":55},{"$f":"IF('UT 4'!E22>0,'UT 4'!E22,\"\")","v":82},{"$f":"IF('UT 5PB1'!E22>0,'UT 5PB1'!E22,\"\")","v":82},{"$f":"IF('PREANNU PB2 '!E22>0,'PREANNU PB2 '!E22,\"\")","v":82},{"$f":"IF(ANNUAL!E22>0,ANNUAL!E22,\"\")","v":49},8.1999999999999993,8.1999999999999993,8.1999999999999993,8.1999999999999993,{"$f":"IF(OR(ISNUMBER(L20),ISNUMBER(M20),ISNUMBER(N20),ISNUMBER(O20),ISNUMBER(G20),ISNUMBER(K20)),SUM(L20,M20,N20,O20,('TT 1'!D21*0.3),(ANNUAL!D21*0.3)),\"\")","v":43},{"$f":"IF(ISNUMBER('UT1'!H22),'UT1'!H22,\"\")","v":49},{"$f":"IF(ISNUMBER('UT 2'!H22),'UT 2'!H22,\"\")","v":82},{"$f":"IF(ISNUMBER('UT 3 '!H22),'UT 3 '!H22,\"\")","v":82},{"$f":"IF('TT 1'!H22>0,'TT 1'!H22,\"\")","v":82},{"$f":"IF('UT 4'!H22>0,'UT 4'!H22,\"\")","v":82},{"$f":"IF('UT 5PB1'!H22>0,'UT 5PB1'!H22,\"\")","v":82},{"$f":"IF('PREANNU PB2 '!H22>0,'PREANNU PB2 '!H22,\"\")","v":82},{"$f":"IF(ANNUAL!H22>0,ANNUAL!H22,\"\")","v":82},8.1999999999999993,8.1999999999999993,8.1999999999999993,8.1999999999999993,{"$f":"IF(OR(ISNUMBER(Y20),ISNUMBER(Z20),ISNUMBER(AA20),ISNUMBER(AB20),ISNUMBER(T20),ISNUMBER(X20)),SUM(Y20,Z20,AA20,AB20,('TT 1'!E21*0.3),(ANNUAL!E21*0.3)),\"\")","v":59.5},{"$f":"IF(ISNUMBER('UT1'!K22),'UT1'!K22,\"\")","v":82},{"$f":"IF(ISNUMBER('UT 2'!K22),'UT 2'!K22,\"\")","v":82},{"$f":"IF(ISNUMBER('UT 3 '!K22),'UT 3 '!K22,\"\")","v":82},{"$f":"IF('TT 1'!K22>0,'TT 1'!K22,\"\")","v":82},{"$f":"IF('UT 4'!K22>0,'UT 4'!K22,\"\")","v":82},{"$f":"IF('UT 5PB1'!K22>0,'UT 5PB1'!K22,\"\")","v":82},{"$f":"IF('PREANNU PB2 '!K22>0,'PREANNU PB2 '!K22,\"\")","v":82},{"$f":"IF(ANNUAL!K22>0,ANNUAL!K22,\"\")","v":82},8.1999999999999993,8.1999999999999993,8.1999999999999993,8.1999999999999993,{"$f":"IF(OR(ISNUMBER(AL20),ISNUMBER(AM20),ISNUMBER(AN20),ISNUMBER(AO20),ISNUMBER(AG20),ISNUMBER(AK20)),SUM(AL20,AM20,AN20,AO20,('TT 1'!R21*0.3),(ANNUAL!R21*0.3)),\"\")","v":47.8},{"$f":"IF(ISNUMBER('UT1'!N22),'UT1'!N22,\"\")","v":82},{"$f":"IF(ISNUMBER('UT 2'!N22),'UT 2'!N22,\"\")","v":82},{"$f":"IF(ISNUMBER('UT 3 '!N22),'UT 3 '!N22,\"\")","v":82},{"$f":"IF('TT 1'!N22>0,'TT 1'!N22,\"\")","v":82},{"$f":"IF('UT 4'!N22>0,'UT 4'!N22,\"\")","v":82},{"$f":"IF('UT 5PB1'!N22>0,'UT 5PB1'!N22,\"\")","v":82},{"$f":"IF('PREANNU PB2 '!N22>0,'PREANNU PB2 '!N22,\"\")","v":82},{"$f":"IF(ANNUAL!N22>0,ANNUAL!N22,\"\")","v":82},8.1999999999999993,8.1999999999999993,8.1999999999999993,8.1999999999999993,{"$f":"IF(OR(ISNUMBER(AY20),ISNUMBER(AZ20),ISNUMBER(BA20),ISNUMBER(BB20),ISNUMBER(AT20),ISNUMBER(AX20)),SUM(AY20,AZ20,BA20,BB20,('TT 1'!AE21*0.3),(ANNUAL!AE21*0.3)),\"\")","v":32.799999999999997},{"$f":"IF(ISNUMBER('UT1'!Q22),'UT1'!Q22,\"\")","v":82},{"$f":"IF(ISNUMBER('UT 2'!Q22),'UT 2'!Q22,\"\")","v":82},{"$f":"IF(ISNUMBER('UT 3 '!Q22),'UT 3 '!Q22,\"\")","v":82},{"$f":"IF('TT 1'!Q22>0,'TT 1'!Q22,\"\")","v":82},{"$f":"IF('UT 4'!Q22>0,'UT 4'!Q22,\"\")","v":82},{"$f":"IF('UT 5PB1'!Q22>0,'UT 5PB1'!Q22,\"\")","v":82},{"$f":"IF('PREANNU PB2 '!Q22>0,'PREANNU PB2 '!Q22,\"\")","v":82},{"$f":"IF(ANNUAL!Q22>0,ANNUAL!Q22,\"\")","v":82},8.1999999999999993,8.1999999999999993,8.1999999999999993,8.1999999999999993,{"$f":"IF(OR(ISNUMBER(BL20),ISNUMBER(BM20),ISNUMBER(BN20),ISNUMBER(BO20),ISNUMBER(BG20),ISNUMBER(BK20)),SUM(BL20,BM20,BN20,BO20,('TT 1'!AR21*0.3),(ANNUAL!AR21*0.3)),\"\")","v":32.799999999999997},{"$f":"IF(ISNUMBER('UT1'!T22),'UT1'!T22,\"\")","v":82},{"$f":"IF(ISNUMBER('UT 2'!T22),'UT 2'!T22,\"\")","v":82},{"$f":"IF(ISNUMBER('UT 3 '!T22),'UT 3 '!T22,\"\")","v":82},{"$f":"IF('TT 1'!T22>0,'TT 1'!T22,\"\")","v":82},{"$f":"IF('UT 4'!T22>0,'UT 4'!T22,\"\")","v":82},{"$f":"IF('UT 5PB1'!T22>0,'UT 5PB1'!T22,\"\")","v":82},{"$f":"IF('PREANNU PB2 '!T22>0,'PREANNU PB2 '!T22,\"\")","v":82},{"$f":"IF(ANNUAL!T22>0,ANNUAL!T22,\"\")","v":82},8.1999999999999993,8.1999999999999993,8.1999999999999993,8.1999999999999993,{"$f":"IF(OR(ISNUMBER(BY20),ISNUMBER(BZ20),ISNUMBER(CA20),ISNUMBER(CB20),ISNUMBER(BT20),ISNUMBER(BX20)),SUM(BY20,BZ20,CA20,CB20,('TT 1'!BE21*0.3),(ANNUAL!BE21*0.3)),\"\")","v":32.799999999999997},{"$f":"IF(ISNUMBER('UT1'!W22),'UT1'!W22,\"\")","v":82},{"$f":"IF(ISNUMBER('UT 2'!W22),'UT 2'!W22,\"\")","v":82},{"$f":"IF(ISNUMBER('UT 3 '!W22),'UT 3 '!W22,\"\")","v":82},{"$f":"IF('TT 1'!W22>0,'TT 1'!W22,\"\")","v":82},{"$f":"IF('UT 4'!W22>0,'UT 4'!W22,\"\")","v":82},{"$f":"IF('UT 5PB1'!W22>0,'UT 5PB1'!W22,\"\")","v":82},{"$f":"IF('PREANNU PB2 '!W22>0,'PREANNU PB2 '!W22,\"\")","v":82},{"$f":"IF(ANNUAL!W22>0,ANNUAL!W22,\"\")","v":82},8.1999999999999993,8.1999999999999993,8.1999999999999993,8.1999999999999993,{"$f":"IF(OR(ISNUMBER(CL20),ISNUMBER(CM20),ISNUMBER(CN20),ISNUMBER(CO20),ISNUMBER(CG20),ISNUMBER(CK20)),SUM(CL20,CM20,CN20,CO20,('TT 1'!BR21*0.3),(ANNUAL!BR21*0.3)),\"\")","v":32.799999999999997},43,59.5,47.8,32.799999999999997,32.799999999999997,32.799999999999997,32.799999999999997,281.50000000000006,{"$f":"CX20/'Student Profile'!P21","v":56.300000000000011},10]
[{"$f":"ANNUAL!A23","v":""},{"$f":"ANNUAL!B23","v":""},{"$f":"IF('Student Profile'!D22>0,'Student Profile'!D22,\"\")","v":""},{"$f":"IF(ISNUMBER('UT1'!E23),'UT1'!E23,\"\")","v":85},{"$f":"IF(ISNUMBER('UT 2'!E23),'UT 2'!E23,\"\")","v":85},{"$f":"IF(ISNUMBER('UT 3 '!E23),'UT 3 '!E23,\"\")","v":85},{"$f":"IF('TT 1'!E23>0,'TT 1'!E23,\"\")","v":57},{"$f":"IF('UT 4'!E23>0,'UT 4'!E23,\"\")","v":85},{"$f":"IF('UT 5PB1'!E23>0,'UT 5PB1'!E23,\"\")","v":85},{"$f":"IF('PREANNU PB2 '!E23>0,'PREANNU PB2 '!E23,\"\")","v":85},{"$f":"IF(ANNUAL!E23>0,ANNUAL!E23,\"\")","v":51},8.5,8.5,8.5,8.5,{"$f":"IF(OR(ISNUMBER(L21),ISNUMBER(M21),ISNUMBER(N21),ISNUMBER(O21),ISNUMBER(G21),ISNUMBER(K21)),SUM(L21,M21,N21,O21,('TT 1'!D22*0.3),(ANNUAL!D22*0.3)),\"\")","v":43},{"$f":"IF(ISNUMBER('UT1'!H23),'UT1'!H23,\"\")","v":51},{"$f":"IF(ISNUMBER('UT 2'!H23),'UT 2'!H23,\"\")","v":85},{"$f":"IF(ISNUMBER('UT 3 '!H23),'UT 3 '!H23,\"\")","v":85},{"$f":"IF('TT 1'!H23>0,'TT 1'!H23,\"\")","v":85},{"$f":"IF('UT 4'!H23>0,'UT 4'!H23,\"\")","v":85},{"$f":"IF('UT 5PB1'!H23>0,'UT 5PB1'!H23,\"\")","v":85},{"$f":"IF('PREANNU PB2 '!H23>0,'PREANNU PB2 '!H23,\"\")","v":85},{"$f":"IF(ANNUAL!H23>0,ANNUAL!H23,\"\")","v":85},8.5,8.5,8.5,8.5,{"$f":"IF(OR(ISNUMBER(Y21),ISNUMBER(Z21),ISNUMBER(AA21),ISNUMBER(AB21),ISNUMBER(T21),ISNUMBER(X21)),SUM(Y21,Z21,AA21,AB21,('TT 1'!E22*0.3),(ANNUAL!E22*0.3)),\"\")","v":65.2},{"$f":"IF(ISNUMBER('UT1'!K23),'UT1'!K23,\"\")","v":85},{"$f":"IF(ISNUMBER('UT 2'!K23),'UT 2'!K23,\"\")","v":85},{"$f":"IF(ISNUMBER('UT 3 '!K23),'UT 3 '!K23,\"\")","v":85},{"$f":"IF('TT 1'!K23>0,'TT 1'!K23,\"\")","v":85},{"$f":"IF('UT 4'!K23>0,'UT 4'!K23,\"\")","v":85},{"$f":"IF('UT 5PB1'!K23>0,'UT 5PB1'!K23,\"\")","v":85},{"$f":"IF('PREANNU PB2 '!K23>0,'PREANNU PB2 '!K23,\"\")","v":85},{"$f":"IF(ANNUAL!K23>0,ANNUAL!K23,\"\")","v":85},8.5,8.5,8.5,8.5,{"$f":"IF(OR(ISNUMBER(AL21),ISNUMBER(AM21),ISNUMBER(AN21),ISNUMBER(AO21),ISNUMBER(AG21),ISNUMBER(AK21)),SUM(AL21,AM21,AN21,AO21,('TT 1'!R22*0.3),(ANNUAL!R22*0.3)),\"\")","v":54.400000000000006},{"$f":"IF(ISNUMBER('UT1'!N23),'UT1'!N23,\"\")","v":85},{"$f":"IF(ISNUMBER('UT 2'!N23),'UT 2'!N23,\"\")","v":85},{"$f":"IF(ISNUMBER('UT 3 '!N23),'UT 3 '!N23,\"\")","v":85},{"$f":"IF('TT 1'!N23>0,'TT 1'!N23,\"\")","v":85},{"$f":"IF('UT 4'!N23>0,'UT 4'!N23,\"\")","v":85},{"$f":"IF('UT 5PB1'!N23>0,'UT 5PB1'!N23,\"\")","v":85},{"$f":"IF('PREANNU PB2 '!N23>0,'PREANNU PB2 '!N23,\"\")","v":85},{"$f":"IF(ANNUAL!N23>0,ANNUAL!N23,\"\")","v":85},8.5,8.5,8.5,8.5,{"$f":"IF(OR(ISNUMBER(AY21),ISNUMBER(AZ21),ISNUMBER(BA21),ISNUMBER(BB21),ISNUMBER(AT21),ISNUMBER(AX21)),SUM(AY21,AZ21,BA21,BB21,('TT 1'!AE22*0.3),(ANNUAL!AE22*0.3)),\"\")","v":34},{"$f":"IF(ISNUMBER('UT1'!Q23),'UT1'!Q23,\"\")","v":85},{"$f":"IF(ISNUMBER('UT 2'!Q23),'UT 2'!Q23,\"\")","v":85},{"$f":"IF(ISNUMBER('UT 3 '!Q23),'UT 3 '!Q23,\"\")","v":85},{"$f":"IF('TT 1'!Q23>0,'TT 1'!Q23,\"\")","v":85},{"$f":"IF('UT 4'!Q23>0,'UT 4'!Q23,\"\")","v":85},{"$f":"IF('UT 5PB1'!Q23>0,'UT 5PB1'!Q23,\"\")","v":85},{"$f":"IF('PREANNU PB2 '!Q23>0,'PREANNU PB2 '!Q23,\"\")","v":85},{"$f":"IF(ANNUAL!Q23>0,ANNUAL!Q23,\"\")","v":85},8.5,8.5,8.5,8.5,{"$f":"IF(OR(ISNUMBER(BL21),ISNUMBER(BM21),ISNUMBER(BN21),ISNUMBER(BO21),ISNUMBER(BG21),ISNUMBER(BK21)),SUM(BL21,BM21,BN21,BO21,('TT 1'!AR22*0.3),(ANNUAL!AR22*0.3)),\"\")","v":34},{"$f":"IF(ISNUMBER('UT1'!T23),'UT1'!T23,\"\")","v":85},{"$f":"IF(ISNUMBER('UT 2'!T23),'UT 2'!T23,\"\")","v":85},{"$f":"IF(ISNUMBER('UT 3 '!T23),'UT 3 '!T23,\"\")","v":85},{"$f":"IF('TT 1'!T23>0,'TT 1'!T23,\"\")","v":85},{"$f":"IF('UT 4'!T23>0,'UT 4'!T23,\"\")","v":85},{"$f":"IF('UT 5PB1'!T23>0,'UT 5PB1'!T23,\"\")","v":85},{"$f":"IF('PREANNU PB2 '!T23>0,'PREANNU PB2 '!T23,\"\")","v":85},{"$f":"IF(ANNUAL!T23>0,ANNUAL!T23,\"\")","v":85},8.5,8.5,8.5,8.5,{"$f":"IF(OR(ISNUMBER(BY21),ISNUMBER(BZ21),ISNUMBER(CA21),ISNUMBER(CB21),ISNUMBER(BT21),ISNUMBER(BX21)),SUM(BY21,BZ21,CA21,CB21,('TT 1'!BE22*0.3),(ANNUAL!BE22*0.3)),\"\")","v":34},{"$f":"IF(ISNUMBER('UT1'!W23),'UT1'!W23,\"\")","v":85},{"$f":"IF(ISNUMBER('UT 2'!W23),'UT 2'!W23,\"\")","v":85},{"$f":"IF(ISNUMBER('UT 3 '!W23),'UT 3 '!W23,\"\")","v":85},{"$f":"IF('TT 1'!W23>0,'TT 1'!W23,\"\")","v":85},{"$f":"IF('UT 4'!W23>0,'UT 4'!W23,\"\")","v":85},{"$f":"IF('UT 5PB1'!W23>0,'UT 5PB1'!W23,\"\")","v":85},{"$f":"IF('PREANNU PB2 '!W23>0,'PREANNU PB2 '!W23,\"\")","v":85},{"$f":"IF(ANNUAL!W23>0,ANNUAL!W23,\"\")","v":85},8.5,8.5,8.5,8.5,{"$f":"IF(OR(ISNUMBER(CL21),ISNUMBER(CM21),ISNUMBER(CN21),ISNUMBER(CO21),ISNUMBER(CG21),ISNUMBER(CK21)),SUM(CL21,CM21,CN21,CO21,('TT 1'!BR22*0.3),(ANNUAL!BR22*0.3)),\"\")","v":34},43,65.2,54.400000000000006,34,34,34,34,298.60000000000002,{"$f":"CX21/'Student Profile'!P22","v":59.720000000000006},5]
[{"$f":"ANNUAL!A24","v":""},{"$f":"ANNUAL!B24","v":""},{"$f":"IF('Student Profile'!D23>0,'Student Profile'!D23,\"\")","v":""},{"$f":"IF(ISNUMBER('UT1'!E24),'UT1'!E24,\"\")","v":67},{"$f":"IF(ISNUMBER('UT 2'!E24),'UT 2'!E24,\"\")","v":67},{"$f":"IF(ISNUMBER('UT 3 '!E24),'UT 3 '!E24,\"\")","v":67},{"$f":"IF('TT 1'!E24>0,'TT 1'!E24,\"\")","v":45},{"$f":"IF('UT 4'!E24>0,'UT 4'!E24,\"\")","v":67},{"$f":"IF('UT 5PB1'!E24>0,'UT 5PB1'!E24,\"\")","v":67},{"$f":"IF('PREANNU PB2 '!E24>0,'PREANNU PB2 '!E24,\"\")","v":67},{"$f":"IF(ANNUAL!E24>0,ANNUAL!E24,\"\")","v":40},6.7,6.7,6.7,6.7,{"$f":"IF(OR(ISNUMBER(L22),ISNUMBER(M22),ISNUMBER(N22),ISNUMBER(O22),ISNUMBER(G22),ISNUMBER(K22)),SUM(L22,M22,N22,O22,('TT 1'!D23*0.3),(ANNUAL!D23*0.3)),\"\")","v":35.799999999999997},{"$f":"IF(ISNUMBER('UT1'!H24),'UT1'!H24,\"\")","v":40},{"$f":"IF(ISNUMBER('UT 2'!H24),'UT 2'!H24,\"\")","v":67},{"$f":"IF(ISNUMBER('UT 3 '!H24),'UT 3 '!H24,\"\")","v":67},{"$f":"IF('TT 1'!H24>0,'TT 1'!H24,\"\")","v":67},{"$f":"IF('UT 4'!H24>0,'UT 4'!H24,\"\")","v":67},{"$f":"IF('UT 5PB1'!H24>0,'UT 5PB1'!H24,\"\")","v":67},{"$f":"IF('PREANNU PB2 '!H24>0,'PREANNU PB2 '!H24,\"\")","v":67},{"$f":"IF(ANNUAL!H24>0,ANNUAL!H24,\"\")","v":67},6.7,6.7,6.7,6.7,{"$f":"IF(OR(ISNUMBER(Y22),ISNUMBER(Z22),ISNUMBER(AA22),ISNUMBER(AB22),ISNUMBER(T22),ISNUMBER(X22)),SUM(Y22,Z22,AA22,AB22,('TT 1'!E23*0.3),(ANNUAL!E23*0.3)),\"\")","v":59.199999999999996},{"$f":"IF(ISNUMBER('UT1'!K24),'UT1'!K24,\"\")","v":67},{"$f":"IF(ISNUMBER('UT 2'!K24),'UT 2'!K24,\"\")","v":67},{"$f":"IF(ISNUMBER('UT 3 '!K24),'UT 3 '!K24,\"\")","v":67},{"$f":"IF('TT 1'!K24>0,'TT 1'!K24,\"\")","v":67},{"$f":"IF('UT 4'!K24>0,'UT 4'!K24,\"\")","v":67},{"$f":"IF('UT 5PB1'!K24>0,'UT 5PB1'!K24,\"\")","v":67},{"$f":"IF('PREANNU PB2 '!K24>0,'PREANNU PB2 '!K24,\"\")","v":67},{"$f":"IF(ANNUAL!K24>0,ANNUAL!K24,\"\")","v":67},6.7,6.7,6.7,6.7,{"$f":"IF(OR(ISNUMBER(AL22),ISNUMBER(AM22),ISNUMBER(AN22),ISNUMBER(AO22),ISNUMBER(AG22),ISNUMBER(AK22)),SUM(AL22,AM22,AN22,AO22,('TT 1'!R23*0.3),(ANNUAL!R23*0.3)),\"\")","v":48.4},{"$f":"IF(ISNUMBER('UT1'!N24),'UT1'!N24,\"\")","v":67},{"$f":"IF(ISNUMBER('UT 2'!N24),'UT 2'!N24,\"\")","v":67},{"$f":"IF(ISNUMBER('UT 3 '!N24),'UT 3 '!N24,\"\")","v":67},{"$f":"IF('TT 1'!N24>0,'TT 1'!N24,\"\")","v":67},{"$f":"IF('UT 4'!N24>0,'UT 4'!N24,\"\")","v":67},{"$f":"IF('UT 5PB1'!N24>0,'UT 5PB1'!N24,\"\")","v":67},{"$f":"IF('PREANNU PB2 '!N24>0,'PREANNU PB2 '!N24,\"\")","v":67},{"$f":"IF(ANNUAL!N24>0,ANNUAL!N24,\"\")","v":67},6.7,6.7,6.7,6.7,{"$f":"IF(OR(ISNUMBER(AY22),ISNUMBER(AZ22),ISNUMBER(BA22),ISNUMBER(BB22),ISNUMBER(AT22),ISNUMBER(AX22)),SUM(AY22,AZ22,BA22,BB22,('TT 1'!AE23*0.3),(ANNUAL!AE23*0.3)),\"\")","v":26.8},{"$f":"IF(ISNUMBER('UT1'!Q24),'UT1'!Q24,\"\")","v":67},{"$f":"IF(ISNUMBER('UT 2'!Q24),'UT 2'!Q24,\"\")","v":67},{"$f":"IF(ISNUMBER('UT 3 '!Q24),'UT 3 '!Q24,\"\")","v":67},{"$f":"IF('TT 1'!Q24>0,'TT 1'!Q24,\"\")","v":67},{"$f":"IF('UT 4'!Q24>0,'UT 4'!Q24,\"\")","v":67},{"$f":"IF('UT 5PB1'!Q24>0,'UT 5PB1'!Q24,\"\")","v":67},{"$f":"IF('PREANNU PB2 '!Q24>0,'PREANNU PB2 '!Q24,\"\")","v":67},{"$f":"IF(ANNUAL!Q24>0,ANNUAL!Q24,\"\")","v":67},6.7,6.7,6.7,6.7,{"$f":"IF(OR(ISNUMBER(BL22),ISNUMBER(BM22),ISNUMBER(BN22),ISNUMBER(BO22),ISNUMBER(BG22),ISNUMBER(BK22)),SUM(BL22,BM22,BN22,BO22,('TT 1'!AR23*0.3),(ANNUAL!AR23*0.3)),\"\")","v":26.8},{"$f":"IF(ISNUMBER('UT1'!T24),'UT1'!T24,\"\")","v":67},{"$f":"IF(ISNUMBER('UT 2'!T24),'UT 2'!T24,\"\")","v":67},{"$f":"IF(ISNUMBER('UT 3 '!T24),'UT 3 '!T24,\"\")","v":67},{"$f":"IF('TT 1'!T24>0,'TT 1'!T24,\"\")","v":67},{"$f":"IF('UT 4'!T24>0,'UT 4'!T24,\"\")","v":67},{"$f":"IF('UT 5PB1'!T24>0,'UT 5PB1'!T24,\"\")","v":67},{"$f":"IF('PREANNU PB2 '!T24>0,'PREANNU PB2 '!T24,\"\")","v":67},{"$f":"IF(ANNUAL!T24>0,ANNUAL!T24,\"\")","v":67},6.7,6.7,6.7,6.7,{"$f":"IF(OR(ISNUMBER(BY22),ISNUMBER(BZ22),ISNUMBER(CA22),ISNUMBER(CB22),ISNUMBER(BT22),ISNUMBER(BX22)),SUM(BY22,BZ22,CA22,CB22,('TT 1'!BE23*0.3),(ANNUAL!BE23*0.3)),\"\")","v":26.8},{"$f":"IF(ISNUMBER('UT1'!W24),'UT1'!W24,\"\")","v":67},{"$f":"IF(ISNUMBER('UT 2'!W24),'UT 2'!W24,\"\")","v":67},{"$f":"IF(ISNUMBER('UT 3 '!W24),'UT 3 '!W24,\"\")","v":67},{"$f":"IF('TT 1'!W24>0,'TT 1'!W24,\"\")","v":67},{"$f":"IF('UT 4'!W24>0,'UT 4'!W24,\"\")","v":67},{"$f":"IF('UT 5PB1'!W24>0,'UT 5PB1'!W24,\"\")","v":67},{"$f":"IF('PREANNU PB2 '!W24>0,'PREANNU PB2 '!W24,\"\")","v":67},{"$f":"IF(ANNUAL!W24>0,ANNUAL!W24,\"\")","v":67},6.7,6.7,6.7,6.7,{"$f":"IF(OR(ISNUMBER(CL22),ISNUMBER(CM22),ISNUMBER(CN22),ISNUMBER(CO22),ISNUMBER(CG22),ISNUMBER(CK22)),SUM(CL22,CM22,CN22,CO22,('TT 1'!BR23*0.3),(ANNUAL!BR23*0.3)),\"\")","v":26.8},35.799999999999997,59.199999999999996,48.4,26.8,26.8,26.8,26.8,250.60000000000005,{"$f":"CX22/'Student Profile'!P23","v":50.120000000000012},32]
[{"$f":"ANNUAL!A25","v":""},{"$f":"ANNUAL!B25","v":""},{"$f":"IF('Student Profile'!D24>0,'Student Profile'!D24,\"\")","v":""},{"$f":"IF(ISNUMBER('UT1'!E25),'UT1'!E25,\"\")","v":82},{"$f":"IF(ISNUMBER('UT 2'!E25),'UT 2'!E25,\"\")","v":82},{"$f":"IF(ISNUMBER('UT 3 '!E25),'UT 3 '!E25,\"\")","v":82},{"$f":"IF('TT 1'!E25>0,'TT 1'!E25,\"\")","v":55},{"$f":"IF('UT 4'!E25>0,'UT 4'!E25,\"\")","v":82},{"$f":"IF('UT 5PB1'!E25>0,'UT 5PB1'!E25,\"\")","v":82},{"$f":"IF('PREANNU PB2 '!E25>0,'PREANNU PB2 '!E25,\"\")","v":82},{"$f":"IF(ANNUAL!E25>0,ANNUAL!E25,\"\")","v":49},8.1999999999999993,8.1999999999999993,8.1999999999999993,8.1999999999999993,{"$f":"IF(OR(ISNUMBER(L23),ISNUMBER(M23),ISNUMBER(N23),ISNUMBER(O23),ISNUMBER(G23),ISNUMBER(K23)),SUM(L23,M23,N23,O23,('TT 1'!D24*0.3),(ANNUAL!D24*0.3)),\"\")","v":41.8},{"$f":"IF(ISNUMBER('UT1'!H25),'UT1'!H25,\"\")","v":49},{"$f":"IF(ISNUMBER('UT 2'!H25),'UT 2'!H25,\"\")","v":82},{"$f":"IF(ISNUMBER('UT 3 '!H25),'UT 3 '!H25,\"\")","v":82},{"$f":"IF('TT 1'!H25>0,'TT 1'!H25,\"\")","v":82},{"$f":"IF('UT 4'!H25>0,'UT 4'!H25,\"\")","v":82},{"$f":"IF('UT 5PB1'!H25>0,'UT 5PB1'!H25,\"\")","v":82},{"$f":"IF('PREANNU PB2 '!H25>0,'PREANNU PB2 '!H25,\"\")","v":82},{"$f":"IF(ANNUAL!H25>0,ANNUAL!H25,\"\")","v":82},8.1999999999999993,8.1999999999999993,8.1999999999999993,8.1999999999999993,{"$f":"IF(OR(ISNUMBER(Y23),ISNUMBER(Z23),ISNUMBER(AA23),ISNUMBER(AB23),ISNUMBER(T23),ISNUMBER(X23)),SUM(Y23,Z23,AA23,AB23,('TT 1'!E24*0.3),(ANNUAL!E24*0.3)),\"\")","v":58.3},{"$f":"IF(ISNUMBER('UT1'!K25),'UT1'!K25,\"\")","v":82},{"$f":"IF(ISNUMBER('UT 2'!K25),'UT 2'!K25,\"\")","v":82},{"$f":"IF(ISNUMBER('UT 3 '!K25),'UT 3 '!K25,\"\")","v":82},{"$f":"IF('TT 1'!K25>0,'TT 1'!K25,\"\")","v":82},{"$f":"IF('UT 4'!K25>0,'UT 4'!K25,\"\")","v":82},{"$f":"IF('UT 5PB1'!K25>0,'UT 5PB1'!K25,\"\")","v":82},{"$f":"IF('PREANNU PB2 '!K25>0,'PREANNU PB2 '!K25,\"\")","v":82},{"$f":"IF(ANNUAL!K25>0,ANNUAL!K25,\"\")","v":82},8.1999999999999993,8.1999999999999993,8.1999999999999993,8.1999999999999993,{"$f":"IF(OR(ISNUMBER(AL23),ISNUMBER(AM23),ISNUMBER(AN23),ISNUMBER(AO23),ISNUMBER(AG23),ISNUMBER(AK23)),SUM(AL23,AM23,AN23,AO23,('TT 1'!R24*0.3),(ANNUAL!R24*0.3)),\"\")","v":47.8},{"$f":"IF(ISNUMBER('UT1'!N25),'UT1'!N25,\"\")","v":82},{"$f":"IF(ISNUMBER('UT 2'!N25),'UT 2'!N25,\"\")","v":82},{"$f":"IF(ISNUMBER('UT 3 '!N25),'UT 3 '!N25,\"\")","v":82},{"$f":"IF('TT 1'!N25>0,'TT 1'!N25,\"\")","v":82},{"$f":"IF('UT 4'!N25>0,'UT 4'!N25,\"\")","v":82},{"$f":"IF('UT 5PB1'!N25>0,'UT 5PB1'!N25,\"\")","v":82},{"$f":"IF('PREANNU PB2 '!N25>0,'PREANNU PB2 '!N25,\"\")","v":82},{"$f":"IF(ANNUAL!N25>0,ANNUAL!N25,\"\")","v":82},8.1999999999999993,8.1999999999999993,8.1999999999999993,8.1999999999999993,{"$f":"IF(OR(ISNUMBER(AY23),ISNUMBER(AZ23),ISNUMBER(BA23),ISNUMBER(BB23),ISNUMBER(AT23),ISNUMBER(AX23)),SUM(AY23,AZ23,BA23,BB23,('TT 1'!AE24*0.3),(ANNUAL!AE24*0.3)),\"\")","v":32.799999999999997},{"$f":"IF(ISNUMBER('UT1'!Q25),'UT1'!Q25,\"\")","v":82},{"$f":"IF(ISNUMBER('UT 2'!Q25),'UT 2'!Q25,\"\")","v":82},{"$f":"IF(ISNUMBER('UT 3 '!Q25),'UT 3 '!Q25,\"\")","v":82},{"$f":"IF('TT 1'!Q25>0,'TT 1'!Q25,\"\")","v":82},{"$f":"IF('UT 4'!Q25>0,'UT 4'!Q25,\"\")","v":82},{"$f":"IF('UT 5PB1'!Q25>0,'UT 5PB1'!Q25,\"\")","v":82},{"$f":"IF('PREANNU PB2 '!Q25>0,'PREANNU PB2 '!Q25,\"\")","v":82},{"$f":"IF(ANNUAL!Q25>0,ANNUAL!Q25,\"\")","v":82},8.1999999999999993,8.1999999999999993,8.1999999999999993,8.1999999999999993,{"$f":"IF(OR(ISNUMBER(BL23),ISNUMBER(BM23),ISNUMBER(BN23),ISNUMBER(BO23),ISNUMBER(BG23),ISNUMBER(BK23)),SUM(BL23,BM23,BN23,BO23,('TT 1'!AR24*0.3),(ANNUAL!AR24*0.3)),\"\")","v":32.799999999999997},{"$f":"IF(ISNUMBER('UT1'!T25),'UT1'!T25,\"\")","v":82},{"$f":"IF(ISNUMBER('UT 2'!T25),'UT 2'!T25,\"\")","v":82},{"$f":"IF(ISNUMBER('UT 3 '!T25),'UT 3 '!T25,\"\")","v":82},{"$f":"IF('TT 1'!T25>0,'TT 1'!T25,\"\")","v":82},{"$f":"IF('UT 4'!T25>0,'UT 4'!T25,\"\")","v":82},{"$f":"IF('UT 5PB1'!T25>0,'UT 5PB1'!T25,\"\")","v":82},{"$f":"IF('PREANNU PB2 '!T25>0,'PREANNU PB2 '!T25,\"\")","v":82},{"$f":"IF(ANNUAL!T25>0,ANNUAL!T25,\"\")","v":82},8.1999999999999993,8.1999999999999993,8.1999999999999993,8.1999999999999993,{"$f":"IF(OR(ISNUMBER(BY23),ISNUMBER(BZ23),ISNUMBER(CA23),ISNUMBER(CB23),ISNUMBER(BT23),ISNUMBER(BX23)),SUM(BY23,BZ23,CA23,CB23,('TT 1'!BE24*0.3),(ANNUAL!BE24*0.3)),\"\")","v":32.799999999999997},{"$f":"IF(ISNUMBER('UT1'!W25),'UT1'!W25,\"\")","v":82},{"$f":"IF(ISNUMBER('UT 2'!W25),'UT 2'!W25,\"\")","v":82},{"$f":"IF(ISNUMBER('UT 3 '!W25),'UT 3 '!W25,\"\")","v":82},{"$f":"IF('TT 1'!W25>0,'TT 1'!W25,\"\")","v":82},{"$f":"IF('UT 4'!W25>0,'UT 4'!W25,\"\")","v":82},{"$f":"IF('UT 5PB1'!W25>0,'UT 5PB1'!W25,\"\")","v":82},{"$f":"IF('PREANNU PB2 '!W25>0,'PREANNU PB2 '!W25,\"\")","v":82},{"$f":"IF(ANNUAL!W25>0,ANNUAL!W25,\"\")","v":82},8.1999999999999993,8.1999999999999993,8.1999999999999993,8.1999999999999993,{"$f":"IF(OR(ISNUMBER(CL23),ISNUMBER(CM23),ISNUMBER(CN23),ISNUMBER(CO23),ISNUMBER(CG23),ISNUMBER(CK23)),SUM(CL23,CM23,CN23,CO23,('TT 1'!BR24*0.3),(ANNUAL!BR24*0.3)),\"\")","v":32.799999999999997},41.8,58.3,47.8,32.799999999999997,32.799999999999997,32.799999999999997,32.799999999999997,279.10000000000002,{"$f":"CX23/'Student Profile'!P24","v":55.820000000000007},14]
[{"$f":"ANNUAL!A26","v":""},{"$f":"ANNUAL!B26","v":""},{"$f":"IF('Student Profile'!D25>0,'Student Profile'!D25,\"\")","v":""},{"$f":"IF(ISNUMBER('UT1'!E26),'UT1'!E26,\"\")","v":77},{"$f":"IF(ISNUMBER('UT 2'!E26),'UT 2'!E26,\"\")","v":77},{"$f":"IF(ISNUMBER('UT 3 '!E26),'UT 3 '!E26,\"\")","v":77},{"$f":"IF('TT 1'!E26>0,'TT 1'!E26,\"\")","v":52},{"$f":"IF('UT 4'!E26>0,'UT 4'!E26,\"\")","v":77},{"$f":"IF('UT 5PB1'!E26>0,'UT 5PB1'!E26,\"\")","v":77},{"$f":"IF('PREANNU PB2 '!E26>0,'PREANNU PB2 '!E26,\"\")","v":77},{"$f":"IF(ANNUAL!E26>0,ANNUAL!E26,\"\")","v":46},7.7,7.7,7.7,7.7,{"$f":"IF(OR(ISNUMBER(L24),ISNUMBER(M24),ISNUMBER(N24),ISNUMBER(O24),ISNUMBER(G24),ISNUMBER(K24)),SUM(L24,M24,N24,O24,('TT 1'!D25*0.3),(ANNUAL!D25*0.3)),\"\")","v":39.799999999999997},{"$f":"IF(ISNUMBER('UT1'!H26),'UT1'!H26,\"\")","v":46},{"$f":"IF(ISNUMBER('UT 2'!H26),'UT 2'!H26,\"\")","v":77},{"$f":"IF(ISNUMBER('UT 3 '!H26),'UT 3 '!H26,\"\")","v":77},{"$f":"IF('TT 1'!H26>0,'TT 1'!H26,\"\")","v":77},{"$f":"IF('UT 4'!H26>0,'UT 4'!H26,\"\")","v":77},{"$f":"IF('UT 5PB1'!H26>0,'UT 5PB1'!H26,\"\")","v":77},{"$f":"IF('PREANNU PB2 '!H26>0,'PREANNU PB2 '!H26,\"\")","v":77},{"$f":"IF(ANNUAL!H26>0,ANNUAL!H26,\"\")","v":77},7.7,7.7,7.7,7.7,{"$f":"IF(OR(ISNUMBER(Y24),ISNUMBER(Z24),ISNUMBER(AA24),ISNUMBER(AB24),ISNUMBER(T24),ISNUMBER(X24)),SUM(Y24,Z24,AA24,AB24,('TT 1'!E25*0.3),(ANNUAL!E25*0.3)),\"\")","v":62},{"$f":"IF(ISNUMBER('UT1'!K26),'UT1'!K26,\"\")","v":77},{"$f":"IF(ISNUMBER('UT 2'!K26),'UT 2'!K26,\"\")","v":77},{"$f":"IF(ISNUMBER('UT 3 '!K26),'UT 3 '!K26,\"\")","v":77},{"$f":"IF('TT 1'!K26>0,'TT 1'!K26,\"\")","v":77},{"$f":"IF('UT 4'!K26>0,'UT 4'!K26,\"\")","v":77},{"$f":"IF('UT 5PB1'!K26>0,'UT 5PB1'!K26,\"\")","v":77},{"$f":"IF('PREANNU PB2 '!K26>0,'PREANNU PB2 '!K26,\"\")","v":77},{"$f":"IF(ANNUAL!K26>0,ANNUAL!K26,\"\")","v":77},7.7,7.7,7.7,7.7,{"$f":"IF(OR(ISNUMBER(AL24),ISNUMBER(AM24),ISNUMBER(AN24),ISNUMBER(AO24),ISNUMBER(AG24),ISNUMBER(AK24)),SUM(AL24,AM24,AN24,AO24,('TT 1'!R25*0.3),(ANNUAL!R25*0.3)),\"\")","v":51.2},{"$f":"IF(ISNUMBER('UT1'!N26),'UT1'!N26,\"\")","v":77},{"$f":"IF(ISNUMBER('UT 2'!N26),'UT 2'!N26,\"\")","v":77},{"$f":"IF(ISNUMBER('UT 3 '!N26),'UT 3 '!N26,\"\")","v":77},{"$f":"IF('TT 1'!N26>0,'TT 1'!N26,\"\")","v":77},{"$f":"IF('UT 4'!N26>0,'UT 4'!N26,\"\")","v":77},{"$f":"IF('UT 5PB1'!N26>0,'UT 5PB1'!N26,\"\")","v":77},{"$f":"IF('PREANNU PB2 '!N26>0,'PREANNU PB2 '!N26,\"\")","v":77},{"$f":"IF(ANNUAL!N26>0,ANNUAL!N26,\"\")","v":77},7.7,7.7,7.7,7.7,{"$f":"IF(OR(ISNUMBER(AY24),ISNUMBER(AZ24),ISNUMBER(BA24),ISNUMBER(BB24),ISNUMBER(AT24),ISNUMBER(AX24)),SUM(AY24,AZ24,BA24,BB24,('TT 1'!AE25*0.3),(ANNUAL!AE25*0.3)),\"\")","v":30.8},{"$f":"IF(ISNUMBER('UT1'!Q26),'UT1'!Q26,\"\")","v":77},{"$f":"IF(ISNUMBER('UT 2'!Q26),'UT 2'!Q26,\"\")","v":77},{"$f":"IF(ISNUMBER('UT 3 '!Q26),'UT 3 '!Q26,\"\")","v":77},{"$f":"IF('TT 1'!Q26>0,'TT 1'!Q26,\"\")","v":77},{"$f":"IF('UT 4'!Q26>0,'UT 4'!Q26,\"\")","v":77},{"$f":"IF('UT 5PB1'!Q26>0,'UT 5PB1'!Q26,\"\")","v":77},{"$f":"IF('PREANNU PB2 '!Q26>0,'PREANNU PB2 '!Q26,\"\")","v":77},{"$f":"IF(ANNUAL!Q26>0,ANNUAL!Q26,\"\")","v":77},7.7,7.7,7.7,7.7,{"$f":"IF(OR(ISNUMBER(BL24),ISNUMBER(BM24),ISNUMBER(BN24),ISNUMBER(BO24),ISNUMBER(BG24),ISNUMBER(BK24)),SUM(BL24,BM24,BN24,BO24,('TT 1'!AR25*0.3),(ANNUAL!AR25*0.3)),\"\")","v":30.8},{"$f":"IF(ISNUMBER('UT1'!T26),'UT1'!T26,\"\")","v":77},{"$f":"IF(ISNUMBER('UT 2'!T26),'UT 2'!T26,\"\")","v":77},{"$f":"IF(ISNUMBER('UT 3 '!T26),'UT 3 '!T26,\"\")","v":77},{"$f":"IF('TT 1'!T26>0,'TT 1'!T26,\"\")","v":77},{"$f":"IF('UT 4'!T26>0,'UT 4'!T26,\"\")","v":77},{"$f":"IF('UT 5PB1'!T26>0,'UT 5PB1'!T26,\"\")","v":77},{"$f":"IF('PREANNU PB2 '!T26>0,'PREANNU PB2 '!T26,\"\")","v":77},{"$f":"IF(ANNUAL!T26>0,ANNUAL!T26,\"\")","v":77},7.7,7.7,7.7,7.7,{"$f":"IF(OR(ISNUMBER(BY24),ISNUMBER(BZ24),ISNUMBER(CA24),ISNUMBER(CB24),ISNUMBER(BT24),ISNUMBER(BX24)),SUM(BY24,BZ24,CA24,CB24,('TT 1'!BE25*0.3),(ANNUAL!BE25*0.3)),\"\")","v":30.8},{"$f":"IF(ISNUMBER('UT1'!W26),'UT1'!W26,\"\")","v":77},{"$f":"IF(ISNUMBER('UT 2'!W26),'UT 2'!W26,\"\")","v":77},{"$f":"IF(ISNUMBER('UT 3 '!W26),'UT 3 '!W26,\"\")","v":77},{"$f":"IF('TT 1'!W26>0,'TT 1'!W26,\"\")","v":77},{"$f":"IF('UT 4'!W26>0,'UT 4'!W26,\"\")","v":77},{"$f":"IF('UT 5PB1'!W26>0,'UT 5PB1'!W26,\"\")","v":77},{"$f":"IF('PREANNU PB2 '!W26>0,'PREANNU PB2 '!W26,\"\")","v":77},{"$f":"IF(ANNUAL!W26>0,ANNUAL!W26,\"\")","v":77},7.7,7.7,7.7,7.7,{"$f":"IF(OR(ISNUMBER(CL24),ISNUMBER(CM24),ISNUMBER(CN24),ISNUMBER(CO24),ISNUMBER(CG24),ISNUMBER(CK24)),SUM(CL24,CM24,CN24,CO24,('TT 1'!BR25*0.3),(ANNUAL!BR25*0.3)),\"\")","v":30.8},39.799999999999997,62,51.2,30.8,30.8,30.8,30.8,276.20000000000005,{"$f":"CX24/'Student Profile'!P25","v":55.240000000000009},19]
[{"$f":"ANNUAL!A27","v":""},{"$f":"ANNUAL!B27","v":""},{"$f":"IF('Student Profile'!D26>0,'Student Profile'!D26,\"\")","v":""},{"$f":"IF(ISNUMBER('UT1'!E27),'UT1'!E27,\"\")","v":74},{"$f":"IF(ISNUMBER('UT 2'!E27),'UT 2'!E27,\"\")","v":74},{"$f":"IF(ISNUMBER('UT 3 '!E27),'UT 3 '!E27,\"\")","v":74},{"$f":"IF('TT 1'!E27>0,'TT 1'!E27,\"\")","v":49},{"$f":"IF('UT 4'!E27>0,'UT 4'!E27,\"\")","v":74},{"$f":"IF('UT 5PB1'!E27>0,'UT 5PB1'!E27,\"\")","v":74},{"$f":"IF('PREANNU PB2 '!E27>0,'PREANNU PB2 '!E27,\"\")","v":74},{"$f":"IF(ANNUAL!E27>0,ANNUAL!E27,\"\")","v":44},7.4,7.4,7.4,7.4,{"$f":"IF(OR(ISNUMBER(L25),ISNUMBER(M25),ISNUMBER(N25),ISNUMBER(O25),ISNUMBER(G25),ISNUMBER(K25)),SUM(L25,M25,N25,O25,('TT 1'!D26*0.3),(ANNUAL!D26*0.3)),\"\")","v":40.4},{"$f":"IF(ISNUMBER('UT1'!H27),'UT1'!H27,\"\")","v":44},{"$f":"IF(ISNUMBER('UT 2'!H27),'UT 2'!H27,\"\")","v":74},{"$f":"IF(ISNUMBER('UT 3 '!H27),'UT 3 '!H27,\"\")","v":74},{"$f":"IF('TT 1'!H27>0,'TT 1'!H27,\"\")","v":74},{"$f":"IF('UT 4'!H27>0,'UT 4'!H27,\"\")","v":74},{"$f":"IF('UT 5PB1'!H27>0,'UT 5PB1'!H27,\"\")","v":74},{"$f":"IF('PREANNU PB2 '!H27>0,'PREANNU PB2 '!H27,\"\")","v":74},{"$f":"IF(ANNUAL!H27>0,ANNUAL!H27,\"\")","v":74},7.4,7.4,7.4,7.4,{"$f":"IF(OR(ISNUMBER(Y25),ISNUMBER(Z25),ISNUMBER(AA25),ISNUMBER(AB25),ISNUMBER(T25),ISNUMBER(X25)),SUM(Y25,Z25,AA25,AB25,('TT 1'!E26*0.3),(ANNUAL!E26*0.3)),\"\")","v":59},{"$f":"IF(ISNUMBER('UT1'!K27),'UT1'!K27,\"\")","v":74},{"$f":"IF(ISNUMBER('UT 2'!K27),'UT 2'!K27,\"\")","v":74},{"$f":"IF(ISNUMBER('UT 3 '!K27),'UT 3 '!K27,\"\")","v":74},{"$f":"IF('TT 1'!K27>0,'TT 1'!K27,\"\")","v":74},{"$f":"IF('UT 4'!K27>0,'UT 4'!K27,\"\")","v":74},{"$f":"IF('UT 5PB1'!K27>0,'UT 5PB1'!K27,\"\")","v":74},{"$f":"IF('PREANNU PB2 '!K27>0,'PREANNU PB2 '!K27,\"\")","v":74},{"$f":"IF(ANNUAL!K27>0,ANNUAL!K27,\"\")","v":74},7.4,7.4,7.4,7.4,{"$f":"IF(OR(ISNUMBER(AL25),ISNUMBER(AM25),ISNUMBER(AN25),ISNUMBER(AO25),ISNUMBER(AG25),ISNUMBER(AK25)),SUM(AL25,AM25,AN25,AO25,('TT 1'!R26*0.3),(ANNUAL!R26*0.3)),\"\")","v":46.4},{"$f":"IF(ISNUMBER('UT1'!N27),'UT1'!N27,\"\")","v":74},{"$f":"IF(ISNUMBER('UT 2'!N27),'UT 2'!N27,\"\")","v":74},{"$f":"IF(ISNUMBER('UT 3 '!N27),'UT 3 '!N27,\"\")","v":74},{"$f":"IF('TT 1'!N27>0,'TT 1'!N27,\"\")","v":74},{"$f":"IF('UT 4'!N27>0,'UT 4'!N27,\"\")","v":74},{"$f":"IF('UT 5PB1'!N27>0,'UT 5PB1'!N27,\"\")","v":74},{"$f":"IF('PREANNU PB2 '!N27>0,'PREANNU PB2 '!N27,\"\")","v":74},{"$f":"IF(ANNUAL!N27>0,ANNUAL!N27,\"\")","v":74},7.4,7.4,7.4,7.4,{"$f":"IF(OR(ISNUMBER(AY25),ISNUMBER(AZ25),ISNUMBER(BA25),ISNUMBER(BB25),ISNUMBER(AT25),ISNUMBER(AX25)),SUM(AY25,AZ25,BA25,BB25,('TT 1'!AE26*0.3),(ANNUAL!AE26*0.3)),\"\")","v":29.6},{"$f":"IF(ISNUMBER('UT1'!Q27),'UT1'!Q27,\"\")","v":74},{"$f":"IF(ISNUMBER('UT 2'!Q27),'UT 2'!Q27,\"\")","v":74},{"$f":"IF(ISNUMBER('UT 3 '!Q27),'UT 3 '!Q27,\"\")","v":74},{"$f":"IF('TT 1'!Q27>0,'TT 1'!Q27,\"\")","v":74},{"$f":"IF('UT 4'!Q27>0,'UT 4'!Q27,\"\")","v":74},{"$f":"IF('UT 5PB1'!Q27>0,'UT 5PB1'!Q27,\"\")","v":74},{"$f":"IF('PREANNU PB2 '!Q27>0,'PREANNU PB2 '!Q27,\"\")","v":74},{"$f":"IF(ANNUAL!Q27>0,ANNUAL!Q27,\"\")","v":74},7.4,7.4,7.4,7.4,{"$f":"IF(OR(ISNUMBER(BL25),ISNUMBER(BM25),ISNUMBER(BN25),ISNUMBER(BO25),ISNUMBER(BG25),ISNUMBER(BK25)),SUM(BL25,BM25,BN25,BO25,('TT 1'!AR26*0.3),(ANNUAL!AR26*0.3)),\"\")","v":29.6},{"$f":"IF(ISNUMBER('UT1'!T27),'UT1'!T27,\"\")","v":74},{"$f":"IF(ISNUMBER('UT 2'!T27),'UT 2'!T27,\"\")","v":74},{"$f":"IF(ISNUMBER('UT 3 '!T27),'UT 3 '!T27,\"\")","v":74},{"$f":"IF('TT 1'!T27>0,'TT 1'!T27,\"\")","v":74},{"$f":"IF('UT 4'!T27>0,'UT 4'!T27,\"\")","v":74},{"$f":"IF('UT 5PB1'!T27>0,'UT 5PB1'!T27,\"\")","v":74},{"$f":"IF('PREANNU PB2 '!T27>0,'PREANNU PB2 '!T27,\"\")","v":74},{"$f":"IF(ANNUAL!T27>0,ANNUAL!T27,\"\")","v":74},7.4,7.4,7.4,7.4,{"$f":"IF(OR(ISNUMBER(BY25),ISNUMBER(BZ25),ISNUMBER(CA25),ISNUMBER(CB25),ISNUMBER(BT25),ISNUMBER(BX25)),SUM(BY25,BZ25,CA25,CB25,('TT 1'!BE26*0.3),(ANNUAL!BE26*0.3)),\"\")","v":29.6},{"$f":"IF(ISNUMBER('UT1'!W27),'UT1'!W27,\"\")","v":74},{"$f":"IF(ISNUMBER('UT 2'!W27),'UT 2'!W27,\"\")","v":74},{"$f":"IF(ISNUMBER('UT 3 '!W27),'UT 3 '!W27,\"\")","v":74},{"$f":"IF('TT 1'!W27>0,'TT 1'!W27,\"\")","v":74},{"$f":"IF('UT 4'!W27>0,'UT 4'!W27,\"\")","v":74},{"$f":"IF('UT 5PB1'!W27>0,'UT 5PB1'!W27,\"\")","v":74},{"$f":"IF('PREANNU PB2 '!W27>0,'PREANNU PB2 '!W27,\"\")","v":74},{"$f":"IF(ANNUAL!W27>0,ANNUAL!W27,\"\")","v":74},7.4,7.4,7.4,7.4,{"$f":"IF(OR(ISNUMBER(CL25),ISNUMBER(CM25),ISNUMBER(CN25),ISNUMBER(CO25),ISNUMBER(CG25),ISNUMBER(CK25)),SUM(CL25,CM25,CN25,CO25,('TT 1'!BR26*0.3),(ANNUAL!BR26*0.3)),\"\")","v":29.6},40.4,59,46.4,29.6,29.6,29.6,29.6,264.2,{"$f":"CX25/'Student Profile'!P26","v":52.839999999999996},24]
[{"$f":"ANNUAL!A28","v":""},{"$f":"ANNUAL!B28","v":""},{"$f":"IF('Student Profile'!D27>0,'Student Profile'!D27,\"\")","v":""},{"$f":"IF(ISNUMBER('UT1'!E28),'UT1'!E28,\"\")","v":50},{"$f":"IF(ISNUMBER('UT 2'!E28),'UT 2'!E28,\"\")","v":50},{"$f":"IF(ISNUMBER('UT 3 '!E28),'UT 3 '!E28,\"\")","v":50},{"$f":"IF('TT 1'!E28>0,'TT 1'!E28,\"\")","v":34},{"$f":"IF('UT 4'!E28>0,'UT 4'!E28,\"\")","v":50},{"$f":"IF('UT 5PB1'!E28>0,'UT 5PB1'!E28,\"\")","v":50},{"$f":"IF('PREANNU PB2 '!E28>0,'PREANNU PB2 '!E28,\"\")","v":50},{"$f":"IF(ANNUAL!E28>0,ANNUAL!E28,\"\")","v":30},5,5,5,5,{"$f":"IF(OR(ISNUMBER(L26),ISNUMBER(M26),ISNUMBER(N26),ISNUMBER(O26),ISNUMBER(G26),ISNUMBER(K26)),SUM(L26,M26,N26,O26,('TT 1'!D27*0.3),(ANNUAL!D27*0.3)),\"\")","v":29},{"$f":"IF(ISNUMBER('UT1'!H28),'UT1'!H28,\"\")","v":30},{"$f":"IF(ISNUMBER('UT 2'!H28),'UT 2'!H28,\"\")","v":50},{"$f":"IF(ISNUMBER('UT 3 '!H28),'UT 3 '!H28,\"\")","v":50},{"$f":"IF('TT 1'!H28>0,'TT 1'!H28,\"\")","v":50},{"$f":"IF('UT 4'!H28>0,'UT 4'!H28,\"\")","v":50},{"$f":"IF('UT 5PB1'!H28>0,'UT 5PB1'!H28,\"\")","v":50},{"$f":"IF('PREANNU PB2 '!H28>0,'PREANNU PB2 '!H28,\"\")","v":50},{"$f":"IF(ANNUAL!H28>0,ANNUAL!H28,\"\")","v":50},5,5,5,5,{"$f":"IF(OR(ISNUMBER(Y26),ISNUMBER(Z26),ISNUMBER(AA26),ISNUMBER(AB26),ISNUMBER(T26),ISNUMBER(X26)),SUM(Y26,Z26,AA26,AB26,('TT 1'!E27*0.3),(ANNUAL!E27*0.3)),\"\")","v":47.900000000000006},{"$f":"IF(ISNUMBER('UT1'!K28),'UT1'!K28,\"\")","v":50},{"$f":"IF(ISNUMBER('UT 2'!K28),'UT 2'!K28,\"\")","v":50},{"$f":"IF(ISNUMBER('UT 3 '!K28),'UT 3 '!K28,\"\")","v":50},{"$f":"IF('TT 1'!K28>0,'TT 1'!K28,\"\")","v":50},{"$f":"IF('UT 4'!K28>0,'UT 4'!K28,\"\")","v":50},{"$f":"IF('UT 5PB1'!K28>0,'UT 5PB1'!K28,\"\")","v":50},{"$f":"IF('PREANNU PB2 '!K28>0,'PREANNU PB2 '!K28,\"\")","v":50},{"$f":"IF(ANNUAL!K28>0,ANNUAL!K28,\"\")","v":50},5,5,5,5,{"$f":"IF(OR(ISNUMBER(AL26),ISNUMBER(AM26),ISNUMBER(AN26),ISNUMBER(AO26),ISNUMBER(AG26),ISNUMBER(AK26)),SUM(AL26,AM26,AN26,AO26,('TT 1'!R27*0.3),(ANNUAL!R27*0.3)),\"\")","v":37.4},{"$f":"IF(ISNUMBER('UT1'!N28),'UT1'!N28,\"\")","v":50},{"$f":"IF(ISNUMBER('UT 2'!N28),'UT 2'!N28,\"\")","v":50},{"$f":"IF(ISNUMBER('UT 3 '!N28),'UT 3 '!N28,\"\")","v":50},{"$f":"IF('TT 1'!N28>0,'TT 1'!N28,\"\")","v":50},{"$f":"IF('UT 4'!N28>0,'UT 4'!N28,\"\")","v":50},{"$f":"IF('UT 5PB1'!N28>0,'UT 5PB1'!N28,\"\")","v":50},{"$f":"IF('PREANNU PB2 '!N28>0,'PREANNU PB2 '!N28,\"\")","v":50},{"$f":"IF(ANNUAL!N28>0,ANNUAL!N28,\"\")","v":50},5,5,5,5,{"$f":"IF(OR(ISNUMBER(AY26),ISNUMBER(AZ26),ISNUMBER(BA26),ISNUMBER(BB26),ISNUMBER(AT26),ISNUMBER(AX26)),SUM(AY26,AZ26,BA26,BB26,('TT 1'!AE27*0.3),(ANNUAL!AE27*0.3)),\"\")","v":20},{"$f":"IF(ISNUMBER('UT1'!Q28),'UT1'!Q28,\"\")","v":50},{"$f":"IF(ISNUMBER('UT 2'!Q28),'UT 2'!Q28,\"\")","v":50},{"$f":"IF(ISNUMBER('UT 3 '!Q28),'UT 3 '!Q28,\"\")","v":50},{"$f":"IF('TT 1'!Q28>0,'TT 1'!Q28,\"\")","v":50},{"$f":"IF('UT 4'!Q28>0,'UT 4'!Q28,\"\")","v":50},{"$f":"IF('UT 5PB1'!Q28>0,'UT 5PB1'!Q28,\"\")","v":50},{"$f":"IF('PREANNU PB2 '!Q28>0,'PREANNU PB2 '!Q28,\"\")","v":50},{"$f":"IF(ANNUAL!Q28>0,ANNUAL!Q28,\"\")","v":50},5,5,5,5,{"$f":"IF(OR(ISNUMBER(BL26),ISNUMBER(BM26),ISNUMBER(BN26),ISNUMBER(BO26),ISNUMBER(BG26),ISNUMBER(BK26)),SUM(BL26,BM26,BN26,BO26,('TT 1'!AR27*0.3),(ANNUAL!AR27*0.3)),\"\")","v":20},{"$f":"IF(ISNUMBER('UT1'!T28),'UT1'!T28,\"\")","v":50},{"$f":"IF(ISNUMBER('UT 2'!T28),'UT 2'!T28,\"\")","v":50},{"$f":"IF(ISNUMBER('UT 3 '!T28),'UT 3 '!T28,\"\")","v":50},{"$f":"IF('TT 1'!T28>0,'TT 1'!T28,\"\")","v":50},{"$f":"IF('UT 4'!T28>0,'UT 4'!T28,\"\")","v":50},{"$f":"IF('UT 5PB1'!T28>0,'UT 5PB1'!T28,\"\")","v":50},{"$f":"IF('PREANNU PB2 '!T28>0,'PREANNU PB2 '!T28,\"\")","v":50},{"$f":"IF(ANNUAL!T28>0,ANNUAL!T28,\"\")","v":50},5,5,5,5,{"$f":"IF(OR(ISNUMBER(BY26),ISNUMBER(BZ26),ISNUMBER(CA26),ISNUMBER(CB26),ISNUMBER(BT26),ISNUMBER(BX26)),SUM(BY26,BZ26,CA26,CB26,('TT 1'!BE27*0.3),(ANNUAL!BE27*0.3)),\"\")","v":20},{"$f":"IF(ISNUMBER('UT1'!W28),'UT1'!W28,\"\")","v":50},{"$f":"IF(ISNUMBER('UT 2'!W28),'UT 2'!W28,\"\")","v":50},{"$f":"IF(ISNUMBER('UT 3 '!W28),'UT 3 '!W28,\"\")","v":50},{"$f":"IF('TT 1'!W28>0,'TT 1'!W28,\"\")","v":50},{"$f":"IF('UT 4'!W28>0,'UT 4'!W28,\"\")","v":50},{"$f":"IF('UT 5PB1'!W28>0,'UT 5PB1'!W28,\"\")","v":50},{"$f":"IF('PREANNU PB2 '!W28>0,'PREANNU PB2 '!W28,\"\")","v":50},{"$f":"IF(ANNUAL!W28>0,ANNUAL!W28,\"\")","v":50},5,5,5,5,{"$f":"IF(OR(ISNUMBER(CL26),ISNUMBER(CM26),ISNUMBER(CN26),ISNUMBER(CO26),ISNUMBER(CG26),ISNUMBER(CK26)),SUM(CL26,CM26,CN26,CO26,('TT 1'!BR27*0.3),(ANNUAL!BR27*0.3)),\"\")","v":20},29,47.900000000000006,37.4,20,20,20,20,194.3,{"$f":"CX26/'Student Profile'!P27","v":38.86},42]
[{"$f":"ANNUAL!A29","v":""},{"$f":"ANNUAL!B29","v":""},{"$f":"IF('Student Profile'!D28>0,'Student Profile'!D28,\"\")","v":""},{"$f":"IF(ISNUMBER('UT1'!E29),'UT1'!E29,\"\")","v":67},{"$f":"IF(ISNUMBER('UT 2'!E29),'UT 2'!E29,\"\")","v":67},{"$f":"IF(ISNUMBER('UT 3 '!E29),'UT 3 '!E29,\"\")","v":67},{"$f":"IF('TT 1'!E29>0,'TT 1'!E29,\"\")","v":45},{"$f":"IF('UT 4'!E29>0,'UT 4'!E29,\"\")","v":67},{"$f":"IF('UT 5PB1'!E29>0,'UT 5PB1'!E29,\"\")","v":67},{"$f":"IF('PREANNU PB2 '!E29>0,'PREANNU PB2 '!E29,\"\")","v":67},{"$f":"IF(ANNUAL!E29>0,ANNUAL!E29,\"\")","v":40},6.7,6.7,6.7,6.7,{"$f":"IF(OR(ISNUMBER(L27),ISNUMBER(M27),ISNUMBER(N27),ISNUMBER(O27),ISNUMBER(G27),ISNUMBER(K27)),SUM(L27,M27,N27,O27,('TT 1'!D28*0.3),(ANNUAL!D28*0.3)),\"\")","v":32.799999999999997},{"$f":"IF(ISNUMBER('UT1'!H29),'UT1'!H29,\"\")","v":40},{"$f":"IF(ISNUMBER('UT 2'!H29),'UT 2'!H29,\"\")","v":67},{"$f":"IF(ISNUMBER('UT 3 '!H29),'UT 3 '!H29,\"\")","v":67},{"$f":"IF('TT 1'!H29>0,'TT 1'!H29,\"\")","v":67},{"$f":"IF('UT 4'!H29>0,'UT 4'!H29,\"\")","v":67},{"$f":"IF('UT 5PB1'!H29>0,'UT 5PB1'!H29,\"\")","v":67},{"$f":"IF('PREANNU PB2 '!H29>0,'PREANNU PB2 '!H29,\"\")","v":67},{"$f":"IF(ANNUAL!H29>0,ANNUAL!H29,\"\")","v":67},6.7,6.7,6.7,6.7,{"$f":"IF(OR(ISNUMBER(Y27),ISNUMBER(Z27),ISNUMBER(AA27),ISNUMBER(AB27),ISNUMBER(T27),ISNUMBER(X27)),SUM(Y27,Z27,AA27,AB27,('TT 1'!E28*0.3),(ANNUAL!E28*0.3)),\"\")","v":46},{"$f":"IF(ISNUMBER('UT1'!K29),'UT1'!K29,\"\")","v":67},{"$f":"IF(ISNUMBER('UT 2'!K29),'UT 2'!K29,\"\")","v":67},{"$f":"IF(ISNUMBER('UT 3 '!K29),'UT 3 '!K29,\"\")","v":67},{"$f":"IF('TT 1'!K29>0,'TT 1'!K29,\"\")","v":67},{"$f":"IF('UT 4'!K29>0,'UT 4'!K29,\"\")","v":67},{"$f":"IF('UT 5PB1'!K29>0,'UT 5PB1'!K29,\"\")","v":67},{"$f":"IF('PREANNU PB2 '!K29>0,'PREANNU PB2 '!K29,\"\")","v":67},{"$f":"IF(ANNUAL!K29>0,ANNUAL!K29,\"\")","v":67},6.7,6.7,6.7,6.7,{"$f":"IF(OR(ISNUMBER(AL27),ISNUMBER(AM27),ISNUMBER(AN27),ISNUMBER(AO27),ISNUMBER(AG27),ISNUMBER(AK27)),SUM(AL27,AM27,AN27,AO27,('TT 1'!R28*0.3),(ANNUAL!R28*0.3)),\"\")","v":38.799999999999997},{"$f":"IF(ISNUMBER('UT1'!N29),'UT1'!N29,\"\")","v":67},{"$f":"IF(ISNUMBER('UT 2'!N29),'UT 2'!N29,\"\")","v":67},{"$f":"IF(ISNUMBER('UT 3 '!N29),'UT 3 '!N29,\"\")","v":67},{"$f":"IF('TT 1'!N29>0,'TT 1'!N29,\"\")","v":67},{"$f":"IF('UT 4'!N29>0,'UT 4'!N29,\"\")","v":67},{"$f":"IF('UT 5PB1'!N29>0,'UT 5PB1'!N29,\"\")","v":67},{"$f":"IF('PREANNU PB2 '!N29>0,'PREANNU PB2 '!N29,\"\")","v":67},{"$f":"IF(ANNUAL!N29>0,ANNUAL!N29,\"\")","v":67},6.7,6.7,6.7,6.7,{"$f":"IF(OR(ISNUMBER(AY27),ISNUMBER(AZ27),ISNUMBER(BA27),ISNUMBER(BB27),ISNUMBER(AT27),ISNUMBER(AX27)),SUM(AY27,AZ27,BA27,BB27,('TT 1'!AE28*0.3),(ANNUAL!AE28*0.3)),\"\")","v":26.8},{"$f":"IF(ISNUMBER('UT1'!Q29),'UT1'!Q29,\"\")","v":67},{"$f":"IF(ISNUMBER('UT 2'!Q29),'UT 2'!Q29,\"\")","v":67},{"$f":"IF(ISNUMBER('UT 3 '!Q29),'UT 3 '!Q29,\"\")","v":67},{"$f":"IF('TT 1'!Q29>0,'TT 1'!Q29,\"\")","v":67},{"$f":"IF('UT 4'!Q29>0,'UT 4'!Q29,\"\")","v":67},{"$f":"IF('UT 5PB1'!Q29>0,'UT 5PB1'!Q29,\"\")","v":67},{"$f":"IF('PREANNU PB2 '!Q29>0,'PREANNU PB2 '!Q29,\"\")","v":67},{"$f":"IF(ANNUAL!Q29>0,ANNUAL!Q29,\"\")","v":67},6.7,6.7,6.7,6.7,{"$f":"IF(OR(ISNUMBER(BL27),ISNUMBER(BM27),ISNUMBER(BN27),ISNUMBER(BO27),ISNUMBER(BG27),ISNUMBER(BK27)),SUM(BL27,BM27,BN27,BO27,('TT 1'!AR28*0.3),(ANNUAL!AR28*0.3)),\"\")","v":26.8},{"$f":"IF(ISNUMBER('UT1'!T29),'UT1'!T29,\"\")","v":67},{"$f":"IF(ISNUMBER('UT 2'!T29),'UT 2'!T29,\"\")","v":67},{"$f":"IF(ISNUMBER('UT 3 '!T29),'UT 3 '!T29,\"\")","v":67},{"$f":"IF('TT 1'!T29>0,'TT 1'!T29,\"\")","v":67},{"$f":"IF('UT 4'!T29>0,'UT 4'!T29,\"\")","v":67},{"$f":"IF('UT 5PB1'!T29>0,'UT 5PB1'!T29,\"\")","v":67},{"$f":"IF('PREANNU PB2 '!T29>0,'PREANNU PB2 '!T29,\"\")","v":67},{"$f":"IF(ANNUAL!T29>0,ANNUAL!T29,\"\")","v":67},6.7,6.7,6.7,6.7,{"$f":"IF(OR(ISNUMBER(BY27),ISNUMBER(BZ27),ISNUMBER(CA27),ISNUMBER(CB27),ISNUMBER(BT27),ISNUMBER(BX27)),SUM(BY27,BZ27,CA27,CB27,('TT 1'!BE28*0.3),(ANNUAL!BE28*0.3)),\"\")","v":26.8},{"$f":"IF(ISNUMBER('UT1'!W29),'UT1'!W29,\"\")","v":67},{"$f":"IF(ISNUMBER('UT 2'!W29),'UT 2'!W29,\"\")","v":67},{"$f":"IF(ISNUMBER('UT 3 '!W29),'UT 3 '!W29,\"\")","v":67},{"$f":"IF('TT 1'!W29>0,'TT 1'!W29,\"\")","v":67},{"$f":"IF('UT 4'!W29>0,'UT 4'!W29,\"\")","v":67},{"$f":"IF('UT 5PB1'!W29>0,'UT 5PB1'!W29,\"\")","v":67},{"$f":"IF('PREANNU PB2 '!W29>0,'PREANNU PB2 '!W29,\"\")","v":67},{"$f":"IF(ANNUAL!W29>0,ANNUAL!W29,\"\")","v":67},6.7,6.7,6.7,6.7,{"$f":"IF(OR(ISNUMBER(CL27),ISNUMBER(CM27),ISNUMBER(CN27),ISNUMBER(CO27),ISNUMBER(CG27),ISNUMBER(CK27)),SUM(CL27,CM27,CN27,CO27,('TT 1'!BR28*0.3),(ANNUAL!BR28*0.3)),\"\")","v":26.8},32.799999999999997,46,38.799999999999997,26.8,26.8,26.8,26.8,224.80000000000004,{"$f":"CX27/'Student Profile'!P28","v":44.960000000000008},38]
[{"$f":"ANNUAL!A30","v":""},{"$f":"ANNUAL!B30","v":""},{"$f":"IF('Student Profile'!D29>0,'Student Profile'!D29,\"\")","v":""},{"$f":"IF(ISNUMBER('UT1'!E30),'UT1'!E30,\"\")","v":92},{"$f":"IF(ISNUMBER('UT 2'!E30),'UT 2'!E30,\"\")","v":92},{"$f":"IF(ISNUMBER('UT 3 '!E30),'UT 3 '!E30,\"\")","v":92},{"$f":"IF('TT 1'!E30>0,'TT 1'!E30,\"\")","v":62},{"$f":"IF('UT 4'!E30>0,'UT 4'!E30,\"\")","v":92},{"$f":"IF('UT 5PB1'!E30>0,'UT 5PB1'!E30,\"\")","v":92},{"$f":"IF('PREANNU PB2 '!E30>0,'PREANNU PB2 '!E30,\"\")","v":92},{"$f":"IF(ANNUAL!E30>0,ANNUAL!E30,\"\")","v":55},9.1999999999999993,9.1999999999999993,9.1999999999999993,9.1999999999999993,{"$f":"IF(OR(ISNUMBER(L28),ISNUMBER(M28),ISNUMBER(N28),ISNUMBER(O28),ISNUMBER(G28),ISNUMBER(K28)),SUM(L28,M28,N28,O28,('TT 1'!D29*0.3),(ANNUAL!D29*0.3)),\"\")","v":45.8},{"$f":"IF(ISNUMBER('UT1'!H30),'UT1'!H30,\"\")","v":55},{"$f":"IF(ISNUMBER('UT 2'!H30),'UT 2'!H30,\"\")","v":92},{"$f":"IF(ISNUMBER('UT 3 '!H30),'UT 3 '!H30,\"\")","v":92},{"$f":"IF('TT 1'!H30>0,'TT 1'!H30,\"\")","v":92},{"$f":"IF('UT 4'!H30>0,'UT 4'!H30,\"\")","v":92},{"$f":"IF('UT 5PB1'!H30>0,'UT 5PB1'!H30,\"\")","v":92},{"$f":"IF('PREANNU PB2 '!H30>0,'PREANNU PB2 '!H30,\"\")","v":92},{"$f":"IF(ANNUAL!H30>0,ANNUAL!H30,\"\")","v":92},9.1999999999999993,9.1999999999999993,9.1999999999999993,9.1999999999999993,{"$f":"IF(OR(ISNUMBER(Y28),ISNUMBER(Z28),ISNUMBER(AA28),ISNUMBER(AB28),ISNUMBER(T28),ISNUMBER(X28)),SUM(Y28,Z28,AA28,AB28,('TT 1'!E29*0.3),(ANNUAL!E29*0.3)),\"\")","v":62.3},{"$f":"IF(ISNUMBER('UT1'!K30),'UT1'!K30,\"\")","v":92},{"$f":"IF(ISNUMBER('UT 2'!K30),'UT 2'!K30,\"\")","v":92},{"$f":"IF(ISNUMBER('UT 3 '!K30),'UT 3 '!K30,\"\")","v":92},{"$f":"IF('TT 1'!K30>0,'TT 1'!K30,\"\")","v":92},{"$f":"IF('UT 4'!K30>0,'UT 4'!K30,\"\")","v":92},{"$f":"IF('UT 5PB1'!K30>0,'UT 5PB1'!K30,\"\")","v":92},{"$f":"IF('PREANNU PB2 '!K30>0,'PREANNU PB2 '!K30,\"\")","v":92},{"$f":"IF(ANNUAL!K30>0,ANNUAL!K30,\"\")","v":92},9.1999999999999993,9.1999999999999993,9.1999999999999993,9.1999999999999993,{"$f":"IF(OR(ISNUMBER(AL28),ISNUMBER(AM28),ISNUMBER(AN28),ISNUMBER(AO28),ISNUMBER(AG28),ISNUMBER(AK28)),SUM(AL28,AM28,AN28,AO28,('TT 1'!R29*0.3),(ANNUAL!R29*0.3)),\"\")","v":51.8},{"$f":"IF(ISNUMBER('UT1'!N30),'UT1'!N30,\"\")","v":92},{"$f":"IF(ISNUMBER('UT 2'!N30),'UT 2'!N30,\"\")","v":92},{"$f":"IF(ISNUMBER('UT 3 '!N30),'UT 3 '!N30,\"\")","v":92},{"$f":"IF('TT 1'!N30>0,'TT 1'!N30,\"\")","v":92},{"$f":"IF('UT 4'!N30>0,'UT 4'!N30,\"\")","v":92},{"$f":"IF('UT 5PB1'!N30>0,'UT 5PB1'!N30,\"\")","v":92},{"$f":"IF('PREANNU PB2 '!N30>0,'PREANNU PB2 '!N30,\"\")","v":92},{"$f":"IF(ANNUAL!N30>0,ANNUAL!N30,\"\")","v":92},9.1999999999999993,9.1999999999999993,9.1999999999999993,9.1999999999999993,{"$f":"IF(OR(ISNUMBER(AY28),ISNUMBER(AZ28),ISNUMBER(BA28),ISNUMBER(BB28),ISNUMBER(AT28),ISNUMBER(AX28)),SUM(AY28,AZ28,BA28,BB28,('TT 1'!AE29*0.3),(ANNUAL!AE29*0.3)),\"\")","v":36.799999999999997},{"$f":"IF(ISNUMBER('UT1'!Q30),'UT1'!Q30,\"\")","v":92},{"$f":"IF(ISNUMBER('UT 2'!Q30),'UT 2'!Q30,\"\")","v":92},{"$f":"IF(ISNUMBER('UT 3 '!Q30),'UT 3 '!Q30,\"\")","v":92},{"$f":"IF('TT 1'!Q30>0,'TT 1'!Q30,\"\")","v":92},{"$f":"IF('UT 4'!Q30>0,'UT 4'!Q30,\"\")","v":92},{"$f":"IF('UT 5PB1'!Q30>0,'UT 5PB1'!Q30,\"\")","v":92},{"$f":"IF('PREANNU PB2 '!Q30>0,'PREANNU PB2 '!Q30,\"\")","v":92},{"$f":"IF(ANNUAL!Q30>0,ANNUAL!Q30,\"\")","v":92},9.1999999999999993,9.1999999999999993,9.1999999999999993,9.1999999999999993,{"$f":"IF(OR(ISNUMBER(BL28),ISNUMBER(BM28),ISNUMBER(BN28),ISNUMBER(BO28),ISNUMBER(BG28),ISNUMBER(BK28)),SUM(BL28,BM28,BN28,BO28,('TT 1'!AR29*0.3),(ANNUAL!AR29*0.3)),\"\")","v":36.799999999999997},{"$f":"IF(ISNUMBER('UT1'!T30),'UT1'!T30,\"\")","v":92},{"$f":"IF(ISNUMBER('UT 2'!T30),'UT 2'!T30,\"\")","v":92},{"$f":"IF(ISNUMBER('UT 3 '!T30),'UT 3 '!T30,\"\")","v":92},{"$f":"IF('TT 1'!T30>0,'TT 1'!T30,\"\")","v":92},{"$f":"IF('UT 4'!T30>0,'UT 4'!T30,\"\")","v":92},{"$f":"IF('UT 5PB1'!T30>0,'UT 5PB1'!T30,\"\")","v":92},{"$f":"IF('PREANNU PB2 '!T30>0,'PREANNU PB2 '!T30,\"\")","v":92},{"$f":"IF(ANNUAL!T30>0,ANNUAL!T30,\"\")","v":92},9.1999999999999993,9.1999999999999993,9.1999999999999993,9.1999999999999993,{"$f":"IF(OR(ISNUMBER(BY28),ISNUMBER(BZ28),ISNUMBER(CA28),ISNUMBER(CB28),ISNUMBER(BT28),ISNUMBER(BX28)),SUM(BY28,BZ28,CA28,CB28,('TT 1'!BE29*0.3),(ANNUAL!BE29*0.3)),\"\")","v":36.799999999999997},{"$f":"IF(ISNUMBER('UT1'!W30),'UT1'!W30,\"\")","v":92},{"$f":"IF(ISNUMBER('UT 2'!W30),'UT 2'!W30,\"\")","v":92},{"$f":"IF(ISNUMBER('UT 3 '!W30),'UT 3 '!W30,\"\")","v":92},{"$f":"IF('TT 1'!W30>0,'TT 1'!W30,\"\")","v":92},{"$f":"IF('UT 4'!W30>0,'UT 4'!W30,\"\")","v":92},{"$f":"IF('UT 5PB1'!W30>0,'UT 5PB1'!W30,\"\")","v":92},{"$f":"IF('PREANNU PB2 '!W30>0,'PREANNU PB2 '!W30,\"\")","v":92},{"$f":"IF(ANNUAL!W30>0,ANNUAL!W30,\"\")","v":92},9.1999999999999993,9.1999999999999993,9.1999999999999993,9.1999999999999993,{"$f":"IF(OR(ISNUMBER(CL28),ISNUMBER(CM28),ISNUMBER(CN28),ISNUMBER(CO28),ISNUMBER(CG28),ISNUMBER(CK28)),SUM(CL28,CM28,CN28,CO28,('TT 1'!BR29*0.3),(ANNUAL!BR29*0.3)),\"\")","v":36.799999999999997},45.8,62.3,51.8,36.799999999999997,36.799999999999997,36.799999999999997,36.799999999999997,307.10000000000002,{"$f":"CX28/'Student Profile'!P29","v":61.42},1]
[{"$f":"ANNUAL!A31","v":""},{"$f":"ANNUAL!B31","v":""},{"$f":"IF('Student Profile'!D30>0,'Student Profile'!D30,\"\")","v":""},{"$f":"IF(ISNUMBER('UT1'!E31),'UT1'!E31,\"\")","v":70},{"$f":"IF(ISNUMBER('UT 2'!E31),'UT 2'!E31,\"\")","v":70},{"$f":"IF(ISNUMBER('UT 3 '!E31),'UT 3 '!E31,\"\")","v":70},{"$f":"IF('TT 1'!E31>0,'TT 1'!E31,\"\")","v":47},{"$f":"IF('UT 4'!E31>0,'UT 4'!E31,\"\")","v":70},{"$f":"IF('UT 5PB1'!E31>0,'UT 5PB1'!E31,\"\")","v":70},{"$f":"IF('PREANNU PB2 '!E31>0,'PREANNU PB2 '!E31,\"\")","v":70},{"$f":"IF(ANNUAL!E31>0,ANNUAL!E31,\"\")","v":42},7,7,7,7,{"$f":"IF(OR(ISNUMBER(L29),ISNUMBER(M29),ISNUMBER(N29),ISNUMBER(O29),ISNUMBER(G29),ISNUMBER(K29)),SUM(L29,M29,N29,O29,('TT 1'!D30*0.3),(ANNUAL!D30*0.3)),\"\")","v":40},{"$f":"IF(ISNUMBER('UT1'!H31),'UT1'!H31,\"\")","v":42},{"$f":"IF(ISNUMBER('UT 2'!H31),'UT 2'!H31,\"\")","v":70},{"$f":"IF(ISNUMBER('UT 3 '!H31),'UT 3 '!H31,\"\")","v":70},{"$f":"IF('TT 1'!H31>0,'TT 1'!H31,\"\")","v":70},{"$f":"IF('UT 4'!H31>0,'UT 4'!H31,\"\")","v":70},{"$f":"IF('UT 5PB1'!H31>0,'UT 5PB1'!H31,\"\")","v":70},{"$f":"IF('PREANNU PB2 '!H31>0,'PREANNU PB2 '!H31,\"\")","v":70},{"$f":"IF(ANNUAL!H31>0,ANNUAL!H31,\"\")","v":70},7,7,7,7,{"$f":"IF(OR(ISNUMBER(Y29),ISNUMBER(Z29),ISNUMBER(AA29),ISNUMBER(AB29),ISNUMBER(T29),ISNUMBER(X29)),SUM(Y29,Z29,AA29,AB29,('TT 1'!E30*0.3),(ANNUAL!E30*0.3)),\"\")","v":63.099999999999994},{"$f":"IF(ISNUMBER('UT1'!K31),'UT1'!K31,\"\")","v":70},{"$f":"IF(ISNUMBER('UT 2'!K31),'UT 2'!K31,\"\")","v":70},{"$f":"IF(ISNUMBER('UT 3 '!K31),'UT 3 '!K31,\"\")","v":70},{"$f":"IF('TT 1'!K31>0,'TT 1'!K31,\"\")","v":70},{"$f":"IF('UT 4'!K31>0,'UT 4'!K31,\"\")","v":70},{"$f":"IF('UT 5PB1'!K31>0,'UT 5PB1'!K31,\"\")","v":70},{"$f":"IF('PREANNU PB2 '!K31>0,'PREANNU PB2 '!K31,\"\")","v":70},{"$f":"IF(ANNUAL!K31>0,ANNUAL!K31,\"\")","v":70},7,7,7,7,{"$f":"IF(OR(ISNUMBER(AL29),ISNUMBER(AM29),ISNUMBER(AN29),ISNUMBER(AO29),ISNUMBER(AG29),ISNUMBER(AK29)),SUM(AL29,AM29,AN29,AO29,('TT 1'!R30*0.3),(ANNUAL!R30*0.3)),\"\")","v":49},{"$f":"IF(ISNUMBER('UT1'!N31),'UT1'!N31,\"\")","v":70},{"$f":"IF(ISNUMBER('UT 2'!N31),'UT 2'!N31,\"\")","v":70},{"$f":"IF(ISNUMBER('UT 3 '!N31),'UT 3 '!N31,\"\")","v":70},{"$f":"IF('TT 1'!N31>0,'TT 1'!N31,\"\")","v":70},{"$f":"IF('UT 4'!N31>0,'UT 4'!N31,\"\")","v":70},{"$f":"IF('UT 5PB1'!N31>0,'UT 5PB1'!N31,\"\")","v":70},{"$f":"IF('PREANNU PB2 '!N31>0,'PREANNU PB2 '!N31,\"\")","v":70},{"$f":"IF(ANNUAL!N31>0,ANNUAL!N31,\"\")","v":70},7,7,7,7,{"$f":"IF(OR(ISNUMBER(AY29),ISNUMBER(AZ29),ISNUMBER(BA29),ISNUMBER(BB29),ISNUMBER(AT29),ISNUMBER(AX29)),SUM(AY29,AZ29,BA29,BB29,('TT 1'!AE30*0.3),(ANNUAL!AE30*0.3)),\"\")","v":28},{"$f":"IF(ISNUMBER('UT1'!Q31),'UT1'!Q31,\"\")","v":70},{"$f":"IF(ISNUMBER('UT 2'!Q31),'UT 2'!Q31,\"\")","v":70},{"$f":"IF(ISNUMBER('UT 3 '!Q31),'UT 3 '!Q31,\"\")","v":70},{"$f":"IF('TT 1'!Q31>0,'TT 1'!Q31,\"\")","v":70},{"$f":"IF('UT 4'!Q31>0,'UT 4'!Q31,\"\")","v":70},{"$f":"IF('UT 5PB1'!Q31>0,'UT 5PB1'!Q31,\"\")","v":70},{"$f":"IF('PREANNU PB2 '!Q31>0,'PREANNU PB2 '!Q31,\"\")","v":70},{"$f":"IF(ANNUAL!Q31>0,ANNUAL!Q31,\"\")","v":70},7,7,7,7,{"$f":"IF(OR(ISNUMBER(BL29),ISNUMBER(BM29),ISNUMBER(BN29),ISNUMBER(BO29),ISNUMBER(BG29),ISNUMBER(BK29)),SUM(BL29,BM29,BN29,BO29,('TT 1'!AR30*0.3),(ANNUAL!AR30*0.3)),\"\")","v":28},{"$f":"IF(ISNUMBER('UT1'!T31),'UT1'!T31,\"\")","v":70},{"$f":"IF(ISNUMBER('UT 2'!T31),'UT 2'!T31,\"\")","v":70},{"$f":"IF(ISNUMBER('UT 3 '!T31),'UT 3 '!T31,\"\")","v":70},{"$f":"IF('TT 1'!T31>0,'TT 1'!T31,\"\")","v":70},{"$f":"IF('UT 4'!T31>0,'UT 4'!T31,\"\")","v":70},{"$f":"IF('UT 5PB1'!T31>0,'UT 5PB1'!T31,\"\")","v":70},{"$f":"IF('PREANNU PB2 '!T31>0,'PREANNU PB2 '!T31,\"\")","v":70},{"$f":"IF(ANNUAL!T31>0,ANNUAL!T31,\"\")","v":70},7,7,7,7,{"$f":"IF(OR(ISNUMBER(BY29),ISNUMBER(BZ29),ISNUMBER(CA29),ISNUMBER(CB29),ISNUMBER(BT29),ISNUMBER(BX29)),SUM(BY29,BZ29,CA29,CB29,('TT 1'!BE30*0.3),(ANNUAL!BE30*0.3)),\"\")","v":28},{"$f":"IF(ISNUMBER('UT1'!W31),'UT1'!W31,\"\")","v":70},{"$f":"IF(ISNUMBER('UT 2'!W31),'UT 2'!W31,\"\")","v":70},{"$f":"IF(ISNUMBER('UT 3 '!W31),'UT 3 '!W31,\"\")","v":70},{"$f":"IF('TT 1'!W31>0,'TT 1'!W31,\"\")","v":70},{"$f":"IF('UT 4'!W31>0,'UT 4'!W31,\"\")","v":70},{"$f":"IF('UT 5PB1'!W31>0,'UT 5PB1'!W31,\"\")","v":70},{"$f":"IF('PREANNU PB2 '!W31>0,'PREANNU PB2 '!W31,\"\")","v":70},{"$f":"IF(ANNUAL!W31>0,ANNUAL!W31,\"\")","v":70},7,7,7,7,{"$f":"IF(OR(ISNUMBER(CL29),ISNUMBER(CM29),ISNUMBER(CN29),ISNUMBER(CO29),ISNUMBER(CG29),ISNUMBER(CK29)),SUM(CL29,CM29,CN29,CO29,('TT 1'!BR30*0.3),(ANNUAL!BR30*0.3)),\"\")","v":28},40,63.099999999999994,49,28,28,28,28,264.10000000000002,{"$f":"CX29/'Student Profile'!P30","v":52.820000000000007},28]
[{"$f":"ANNUAL!A32","v":""},{"$f":"ANNUAL!B32","v":""},{"$f":"IF('Student Profile'!D31>0,'Student Profile'!D31,\"\")","v":""},{"$f":"IF(ISNUMBER('UT1'!E32),'UT1'!E32,\"\")","v":82},{"$f":"IF(ISNUMBER('UT 2'!E32),'UT 2'!E32,\"\")","v":82},{"$f":"IF(ISNUMBER('UT 3 '!E32),'UT 3 '!E32,\"\")","v":82},{"$f":"IF('TT 1'!E32>0,'TT 1'!E32,\"\")","v":55},{"$f":"IF('UT 4'!E32>0,'UT 4'!E32,\"\")","v":82},{"$f":"IF('UT 5PB1'!E32>0,'UT 5PB1'!E32,\"\")","v":82},{"$f":"IF('PREANNU PB2 '!E32>0,'PREANNU PB2 '!E32,\"\")","v":82},{"$f":"IF(ANNUAL!E32>0,ANNUAL!E32,\"\")","v":49},8.1999999999999993,8.1999999999999993,8.1999999999999993,8.1999999999999993,{"$f":"IF(OR(ISNUMBER(L30),ISNUMBER(M30),ISNUMBER(N30),ISNUMBER(O30),ISNUMBER(G30),ISNUMBER(K30)),SUM(L30,M30,N30,O30,('TT 1'!D31*0.3),(ANNUAL!D31*0.3)),\"\")","v":43},{"$f":"IF(ISNUMBER('UT1'!H32),'UT1'!H32,\"\")","v":49},{"$f":"IF(ISNUMBER('UT 2'!H32),'UT 2'!H32,\"\")","v":82},{"$f":"IF(ISNUMBER('UT 3 '!H32),'UT 3 '!H32,\"\")","v":82},{"$f":"IF('TT 1'!H32>0,'TT 1'!H32,\"\")","v":82},{"$f":"IF('UT 4'!H32>0,'UT 4'!H32,\"\")","v":82},{"$f":"IF('UT 5PB1'!H32>0,'UT 5PB1'!H32,\"\")","v":82},{"$f":"IF('PREANNU PB2 '!H32>0,'PREANNU PB2 '!H32,\"\")","v":82},{"$f":"IF(ANNUAL!H32>0,ANNUAL!H32,\"\")","v":82},8.1999999999999993,8.1999999999999993,8.1999999999999993,8.1999999999999993,{"$f":"IF(OR(ISNUMBER(Y30),ISNUMBER(Z30),ISNUMBER(AA30),ISNUMBER(AB30),ISNUMBER(T30),ISNUMBER(X30)),SUM(Y30,Z30,AA30,AB30,('TT 1'!E31*0.3),(ANNUAL!E31*0.3)),\"\")","v":59.5},{"$f":"IF(ISNUMBER('UT1'!K32),'UT1'!K32,\"\")","v":82},{"$f":"IF(ISNUMBER('UT 2'!K32),'UT 2'!K32,\"\")","v":82},{"$f":"IF(ISNUMBER('UT 3 '!K32),'UT 3 '!K32,\"\")","v":82},{"$f":"IF('TT 1'!K32>0,'TT 1'!K32,\"\")","v":82},{"$f":"IF('UT 4'!K32>0,'UT 4'!K32,\"\")","v":82},{"$f":"IF('UT 5PB1'!K32>0,'UT 5PB1'!K32,\"\")","v":82},{"$f":"IF('PREANNU PB2 '!K32>0,'PREANNU PB2 '!K32,\"\")","v":82},{"$f":"IF(ANNUAL!K32>0,ANNUAL!K32,\"\")","v":82},8.1999999999999993,8.1999999999999993,8.1999999999999993,8.1999999999999993,{"$f":"IF(OR(ISNUMBER(AL30),ISNUMBER(AM30),ISNUMBER(AN30),ISNUMBER(AO30),ISNUMBER(AG30),ISNUMBER(AK30)),SUM(AL30,AM30,AN30,AO30,('TT 1'!R31*0.3),(ANNUAL!R31*0.3)),\"\")","v":47.8},{"$f":"IF(ISNUMBER('UT1'!N32),'UT1'!N32,\"\")","v":82},{"$f":"IF(ISNUMBER('UT 2'!N32),'UT 2'!N32,\"\")","v":82},{"$f":"IF(ISNUMBER('UT 3 '!N32),'UT 3 '!N32,\"\")","v":82},{"$f":"IF('TT 1'!N32>0,'TT 1'!N32,\"\")","v":82},{"$f":"IF('UT 4'!N32>0,'UT 4'!N32,\"\")","v":82},{"$f":"IF('UT 5PB1'!N32>0,'UT 5PB1'!N32,\"\")","v":82},{"$f":"IF('PREANNU PB2 '!N32>0,'PREANNU PB2 '!N32,\"\")","v":82},{"$f":"IF(ANNUAL!N32>0,ANNUAL!N32,\"\")","v":82},8.1999999999999993,8.1999999999999993,8.1999999999999993,8.1999999999999993,{"$f":"IF(OR(ISNUMBER(AY30),ISNUMBER(AZ30),ISNUMBER(BA30),ISNUMBER(BB30),ISNUMBER(AT30),ISNUMBER(AX30)),SUM(AY30,AZ30,BA30,BB30,('TT 1'!AE31*0.3),(ANNUAL!AE31*0.3)),\"\")","v":32.799999999999997},{"$f":"IF(ISNUMBER('UT1'!Q32),'UT1'!Q32,\"\")","v":82},{"$f":"IF(ISNUMBER('UT 2'!Q32),'UT 2'!Q32,\"\")","v":82},{"$f":"IF(ISNUMBER('UT 3 '!Q32),'UT 3 '!Q32,\"\")","v":82},{"$f":"IF('TT 1'!Q32>0,'TT 1'!Q32,\"\")","v":82},{"$f":"IF('UT 4'!Q32>0,'UT 4'!Q32,\"\")","v":82},{"$f":"IF('UT 5PB1'!Q32>0,'UT 5PB1'!Q32,\"\")","v":82},{"$f":"IF('PREANNU PB2 '!Q32>0,'PREANNU PB2 '!Q32,\"\")","v":82},{"$f":"IF(ANNUAL!Q32>0,ANNUAL!Q32,\"\")","v":82},8.1999999999999993,8.1999999999999993,8.1999999999999993,8.1999999999999993,{"$f":"IF(OR(ISNUMBER(BL30),ISNUMBER(BM30),ISNUMBER(BN30),ISNUMBER(BO30),ISNUMBER(BG30),ISNUMBER(BK30)),SUM(BL30,BM30,BN30,BO30,('TT 1'!AR31*0.3),(ANNUAL!AR31*0.3)),\"\")","v":32.799999999999997},{"$f":"IF(ISNUMBER('UT1'!T32),'UT1'!T32,\"\")","v":82},{"$f":"IF(ISNUMBER('UT 2'!T32),'UT 2'!T32,\"\")","v":82},{"$f":"IF(ISNUMBER('UT 3 '!T32),'UT 3 '!T32,\"\")","v":82},{"$f":"IF('TT 1'!T32>0,'TT 1'!T32,\"\")","v":82},{"$f":"IF('UT 4'!T32>0,'UT 4'!T32,\"\")","v":82},{"$f":"IF('UT 5PB1'!T32>0,'UT 5PB1'!T32,\"\")","v":82},{"$f":"IF('PREANNU PB2 '!T32>0,'PREANNU PB2 '!T32,\"\")","v":82},{"$f":"IF(ANNUAL!T32>0,ANNUAL!T32,\"\")","v":82},8.1999999999999993,8.1999999999999993,8.1999999999999993,8.1999999999999993,{"$f":"IF(OR(ISNUMBER(BY30),ISNUMBER(BZ30),ISNUMBER(CA30),ISNUMBER(CB30),ISNUMBER(BT30),ISNUMBER(BX30)),SUM(BY30,BZ30,CA30,CB30,('TT 1'!BE31*0.3),(ANNUAL!BE31*0.3)),\"\")","v":32.799999999999997},{"$f":"IF(ISNUMBER('UT1'!W32),'UT1'!W32,\"\")","v":82},{"$f":"IF(ISNUMBER('UT 2'!W32),'UT 2'!W32,\"\")","v":82},{"$f":"IF(ISNUMBER('UT 3 '!W32),'UT 3 '!W32,\"\")","v":82},{"$f":"IF('TT 1'!W32>0,'TT 1'!W32,\"\")","v":82},{"$f":"IF('UT 4'!W32>0,'UT 4'!W32,\"\")","v":82},{"$f":"IF('UT 5PB1'!W32>0,'UT 5PB1'!W32,\"\")","v":82},{"$f":"IF('PREANNU PB2 '!W32>0,'PREANNU PB2 '!W32,\"\")","v":82},{"$f":"IF(ANNUAL!W32>0,ANNUAL!W32,\"\")","v":82},8.1999999999999993,8.1999999999999993,8.1999999999999993,8.1999999999999993,{"$f":"IF(OR(ISNUMBER(CL30),ISNUMBER(CM30),ISNUMBER(CN30),ISNUMBER(CO30),ISNUMBER(CG30),ISNUMBER(CK30)),SUM(CL30,CM30,CN30,CO30,('TT 1'!BR31*0.3),(ANNUAL!BR31*0.3)),\"\")","v":32.799999999999997},43,59.5,47.8,32.799999999999997,32.799999999999997,32.799999999999997,32.799999999999997,281.50000000000006,{"$f":"CX30/'Student Profile'!P31","v":56.300000000000011},10]
[{"$f":"ANNUAL!A33","v":""},{"$f":"ANNUAL!B33","v":""},{"$f":"IF('Student Profile'!D32>0,'Student Profile'!D32,\"\")","v":""},{"$f":"IF(ISNUMBER('UT1'!E33),'UT1'!E33,\"\")","v":85},{"$f":"IF(ISNUMBER('UT 2'!E33),'UT 2'!E33,\"\")","v":85},{"$f":"IF(ISNUMBER('UT 3 '!E33),'UT 3 '!E33,\"\")","v":85},{"$f":"IF('TT 1'!E33>0,'TT 1'!E33,\"\")","v":57},{"$f":"IF('UT 4'!E33>0,'UT 4'!E33,\"\")","v":85},{"$f":"IF('UT 5PB1'!E33>0,'UT 5PB1'!E33,\"\")","v":85},{"$f":"IF('PREANNU PB2 '!E33>0,'PREANNU PB2 '!E33,\"\")","v":85},{"$f":"IF(ANNUAL!E33>0,ANNUAL!E33,\"\")","v":51},8.5,8.5,8.5,8.5,{"$f":"IF(OR(ISNUMBER(L31),ISNUMBER(M31),ISNUMBER(N31),ISNUMBER(O31),ISNUMBER(G31),ISNUMBER(K31)),SUM(L31,M31,N31,O31,('TT 1'!D32*0.3),(ANNUAL!D32*0.3)),\"\")","v":43},{"$f":"IF(ISNUMBER('UT1'!H33),'UT1'!H33,\"\")","v":51},{"$f":"IF(ISNUMBER('UT 2'!H33),'UT 2'!H33,\"\")","v":85},{"$f":"IF(ISNUMBER('UT 3 '!H33),'UT 3 '!H33,\"\")","v":85},{"$f":"IF('TT 1'!H33>0,'TT 1'!H33,\"\")","v":85},{"$f":"IF('UT 4'!H33>0,'UT 4'!H33,\"\")","v":85},{"$f":"IF('UT 5PB1'!H33>0,'UT 5PB1'!H33,\"\")","v":85},{"$f":"IF('PREANNU PB2 '!H33>0,'PREANNU PB2 '!H33,\"\")","v":85},{"$f":"IF(ANNUAL!H33>0,ANNUAL!H33,\"\")","v":85},8.5,8.5,8.5,8.5,{"$f":"IF(OR(ISNUMBER(Y31),ISNUMBER(Z31),ISNUMBER(AA31),ISNUMBER(AB31),ISNUMBER(T31),ISNUMBER(X31)),SUM(Y31,Z31,AA31,AB31,('TT 1'!E32*0.3),(ANNUAL!E32*0.3)),\"\")","v":65.2},{"$f":"IF(ISNUMBER('UT1'!K33),'UT1'!K33,\"\")","v":85},{"$f":"IF(ISNUMBER('UT 2'!K33),'UT 2'!K33,\"\")","v":85},{"$f":"IF(ISNUMBER('UT 3 '!K33),'UT 3 '!K33,\"\")","v":85},{"$f":"IF('TT 1'!K33>0,'TT 1'!K33,\"\")","v":85},{"$f":"IF('UT 4'!K33>0,'UT 4'!K33,\"\")","v":85},{"$f":"IF('UT 5PB1'!K33>0,'UT 5PB1'!K33,\"\")","v":85},{"$f":"IF('PREANNU PB2 '!K33>0,'PREANNU PB2 '!K33,\"\")","v":85},{"$f":"IF(ANNUAL!K33>0,ANNUAL!K33,\"\")","v":85},8.5,8.5,8.5,8.5,{"$f":"IF(OR(ISNUMBER(AL31),ISNUMBER(AM31),ISNUMBER(AN31),ISNUMBER(AO31),ISNUMBER(AG31),ISNUMBER(AK31)),SUM(AL31,AM31,AN31,AO31,('TT 1'!R32*0.3),(ANNUAL!R32*0.3)),\"\")","v":54.400000000000006},{"$f":"IF(ISNUMBER('UT1'!N33),'UT1'!N33,\"\")","v":85},{"$f":"IF(ISNUMBER('UT 2'!N33),'UT 2'!N33,\"\")","v":85},{"$f":"IF(ISNUMBER('UT 3 '!N33),'UT 3 '!N33,\"\")","v":85},{"$f":"IF('TT 1'!N33>0,'TT 1'!N33,\"\")","v":85},{"$f":"IF('UT 4'!N33>0,'UT 4'!N33,\"\")","v":85},{"$f":"IF('UT 5PB1'!N33>0,'UT 5PB1'!N33,\"\")","v":85},{"$f":"IF('PREANNU PB2 '!N33>0,'PREANNU PB2 '!N33,\"\")","v":85},{"$f":"IF(ANNUAL!N33>0,ANNUAL!N33,\"\")","v":85},8.5,8.5,8.5,8.5,{"$f":"IF(OR(ISNUMBER(AY31),ISNUMBER(AZ31),ISNUMBER(BA31),ISNUMBER(BB31),ISNUMBER(AT31),ISNUMBER(AX31)),SUM(AY31,AZ31,BA31,BB31,('TT 1'!AE32*0.3),(ANNUAL!AE32*0.3)),\"\")","v":34},{"$f":"IF(ISNUMBER('UT1'!Q33),'UT1'!Q33,\"\")","v":85},{"$f":"IF(ISNUMBER('UT 2'!Q33),'UT 2'!Q33,\"\")","v":85},{"$f":"IF(ISNUMBER('UT 3 '!Q33),'UT 3 '!Q33,\"\")","v":85},{"$f":"IF('TT 1'!Q33>0,'TT 1'!Q33,\"\")","v":85},{"$f":"IF('UT 4'!Q33>0,'UT 4'!Q33,\"\")","v":85},{"$f":"IF('UT 5PB1'!Q33>0,'UT 5PB1'!Q33,\"\")","v":85},{"$f":"IF('PREANNU PB2 '!Q33>0,'PREANNU PB2 '!Q33,\"\")","v":85},{"$f":"IF(ANNUAL!Q33>0,ANNUAL!Q33,\"\")","v":85},8.5,8.5,8.5,8.5,{"$f":"IF(OR(ISNUMBER(BL31),ISNUMBER(BM31),ISNUMBER(BN31),ISNUMBER(BO31),ISNUMBER(BG31),ISNUMBER(BK31)),SUM(BL31,BM31,BN31,BO31,('TT 1'!AR32*0.3),(ANNUAL!AR32*0.3)),\"\")","v":34},{"$f":"IF(ISNUMBER('UT1'!T33),'UT1'!T33,\"\")","v":85},{"$f":"IF(ISNUMBER('UT 2'!T33),'UT 2'!T33,\"\")","v":85},{"$f":"IF(ISNUMBER('UT 3 '!T33),'UT 3 '!T33,\"\")","v":85},{"$f":"IF('TT 1'!T33>0,'TT 1'!T33,\"\")","v":85},{"$f":"IF('UT 4'!T33>0,'UT 4'!T33,\"\")","v":85},{"$f":"IF('UT 5PB1'!T33>0,'UT 5PB1'!T33,\"\")","v":85},{"$f":"IF('PREANNU PB2 '!T33>0,'PREANNU PB2 '!T33,\"\")","v":85},{"$f":"IF(ANNUAL!T33>0,ANNUAL!T33,\"\")","v":85},8.5,8.5,8.5,8.5,{"$f":"IF(OR(ISNUMBER(BY31),ISNUMBER(BZ31),ISNUMBER(CA31),ISNUMBER(CB31),ISNUMBER(BT31),ISNUMBER(BX31)),SUM(BY31,BZ31,CA31,CB31,('TT 1'!BE32*0.3),(ANNUAL!BE32*0.3)),\"\")","v":34},{"$f":"IF(ISNUMBER('UT1'!W33),'UT1'!W33,\"\")","v":85},{"$f":"IF(ISNUMBER('UT 2'!W33),'UT 2'!W33,\"\")","v":85},{"$f":"IF(ISNUMBER('UT 3 '!W33),'UT 3 '!W33,\"\")","v":85},{"$f":"IF('TT 1'!W33>0,'TT 1'!W33,\"\")","v":85},{"$f":"IF('UT 4'!W33>0,'UT 4'!W33,\"\")","v":85},{"$f":"IF('UT 5PB1'!W33>0,'UT 5PB1'!W33,\"\")","v":85},{"$f":"IF('PREANNU PB2 '!W33>0,'PREANNU PB2 '!W33,\"\")","v":85},{"$f":"IF(ANNUAL!W33>0,ANNUAL!W33,\"\")","v":85},8.5,8.5,8.5,8.5,{"$f":"IF(OR(ISNUMBER(CL31),ISNUMBER(CM31),ISNUMBER(CN31),ISNUMBER(CO31),ISNUMBER(CG31),ISNUMBER(CK31)),SUM(CL31,CM31,CN31,CO31,('TT 1'!BR32*0.3),(ANNUAL!BR32*0.3)),\"\")","v":34},43,65.2,54.400000000000006,34,34,34,34,298.60000000000002,{"$f":"CX31/'Student Profile'!P32","v":59.720000000000006},5]
[{"$f":"ANNUAL!A34","v":""},{"$f":"ANNUAL!B34","v":""},{"$f":"IF('Student Profile'!D33>0,'Student Profile'!D33,\"\")","v":""},{"$f":"IF(ISNUMBER('UT1'!E34),'UT1'!E34,\"\")","v":67},{"$f":"IF(ISNUMBER('UT 2'!E34),'UT 2'!E34,\"\")","v":67},{"$f":"IF(ISNUMBER('UT 3 '!E34),'UT 3 '!E34,\"\")","v":67},{"$f":"IF('TT 1'!E34>0,'TT 1'!E34,\"\")","v":45},{"$f":"IF('UT 4'!E34>0,'UT 4'!E34,\"\")","v":67},{"$f":"IF('UT 5PB1'!E34>0,'UT 5PB1'!E34,\"\")","v":67},{"$f":"IF('PREANNU PB2 '!E34>0,'PREANNU PB2 '!E34,\"\")","v":67},{"$f":"IF(ANNUAL!E34>0,ANNUAL!E34,\"\")","v":40},6.7,6.7,6.7,6.7,{"$f":"IF(OR(ISNUMBER(L32),ISNUMBER(M32),ISNUMBER(N32),ISNUMBER(O32),ISNUMBER(G32),ISNUMBER(K32)),SUM(L32,M32,N32,O32,('TT 1'!D33*0.3),(ANNUAL!D33*0.3)),\"\")","v":35.799999999999997},{"$f":"IF(ISNUMBER('UT1'!H34),'UT1'!H34,\"\")","v":40},{"$f":"IF(ISNUMBER('UT 2'!H34),'UT 2'!H34,\"\")","v":67},{"$f":"IF(ISNUMBER('UT 3 '!H34),'UT 3 '!H34,\"\")","v":67},{"$f":"IF('TT 1'!H34>0,'TT 1'!H34,\"\")","v":67},{"$f":"IF('UT 4'!H34>0,'UT 4'!H34,\"\")","v":67},{"$f":"IF('UT 5PB1'!H34>0,'UT 5PB1'!H34,\"\")","v":67},{"$f":"IF('PREANNU PB2 '!H34>0,'PREANNU PB2 '!H34,\"\")","v":67},{"$f":"IF(ANNUAL!H34>0,ANNUAL!H34,\"\")","v":67},6.7,6.7,6.7,6.7,{"$f":"IF(OR(ISNUMBER(Y32),ISNUMBER(Z32),ISNUMBER(AA32),ISNUMBER(AB32),ISNUMBER(T32),ISNUMBER(X32)),SUM(Y32,Z32,AA32,AB32,('TT 1'!E33*0.3),(ANNUAL!E33*0.3)),\"\")","v":59.199999999999996},{"$f":"IF(ISNUMBER('UT1'!K34),'UT1'!K34,\"\")","v":67},{"$f":"IF(ISNUMBER('UT 2'!K34),'UT 2'!K34,\"\")","v":67},{"$f":"IF(ISNUMBER('UT 3 '!K34),'UT 3 '!K34,\"\")","v":67},{"$f":"IF('TT 1'!K34>0,'TT 1'!K34,\"\")","v":67},{"$f":"IF('UT 4'!K34>0,'UT 4'!K34,\"\")","v":67},{"$f":"IF('UT 5PB1'!K34>0,'UT 5PB1'!K34,\"\")","v":67},{"$f":"IF('PREANNU PB2 '!K34>0,'PREANNU PB2 '!K34,\"\")","v":67},{"$f":"IF(ANNUAL!K34>0,ANNUAL!K34,\"\")","v":67},6.7,6.7,6.7,6.7,{"$f":"IF(OR(ISNUMBER(AL32),ISNUMBER(AM32),ISNUMBER(AN32),ISNUMBER(AO32),ISNUMBER(AG32),ISNUMBER(AK32)),SUM(AL32,AM32,AN32,AO32,('TT 1'!R33*0.3),(ANNUAL!R33*0.3)),\"\")","v":48.4},{"$f":"IF(ISNUMBER('UT1'!N34),'UT1'!N34,\"\")","v":67},{"$f":"IF(ISNUMBER('UT 2'!N34),'UT 2'!N34,\"\")","v":67},{"$f":"IF(ISNUMBER('UT 3 '!N34),'UT 3 '!N34,\"\")","v":67},{"$f":"IF('TT 1'!N34>0,'TT 1'!N34,\"\")","v":67},{"$f":"IF('UT 4'!N34>0,'UT 4'!N34,\"\")","v":67},{"$f":"IF('UT 5PB1'!N34>0,'UT 5PB1'!N34,\"\")","v":67},{"$f":"IF('PREANNU PB2 '!N34>0,'PREANNU PB2 '!N34,\"\")","v":67},{"$f":"IF(ANNUAL!N34>0,ANNUAL!N34,\"\")","v":67},6.7,6.7,6.7,6.7,{"$f":"IF(OR(ISNUMBER(AY32),ISNUMBER(AZ32),ISNUMBER(BA32),ISNUMBER(BB32),ISNUMBER(AT32),ISNUMBER(AX32)),SUM(AY32,AZ32,BA32,BB32,('TT 1'!AE33*0.3),(ANNUAL!AE33*0.3)),\"\")","v":26.8},{"$f":"IF(ISNUMBER('UT1'!Q34),'UT1'!Q34,\"\")","v":67},{"$f":"IF(ISNUMBER('UT 2'!Q34),'UT 2'!Q34,\"\")","v":67},{"$f":"IF(ISNUMBER('UT 3 '!Q34),'UT 3 '!Q34,\"\")","v":67},{"$f":"IF('TT 1'!Q34>0,'TT 1'!Q34,\"\")","v":67},{"$f":"IF('UT 4'!Q34>0,'UT 4'!Q34,\"\")","v":67},{"$f":"IF('UT 5PB1'!Q34>0,'UT 5PB1'!Q34,\"\")","v":67},{"$f":"IF('PREANNU PB2 '!Q34>0,'PREANNU PB2 '!Q34,\"\")","v":67},{"$f":"IF(ANNUAL!Q34>0,ANNUAL!Q34,\"\")","v":67},6.7,6.7,6.7,6.7,{"$f":"IF(OR(ISNUMBER(BL32),ISNUMBER(BM32),ISNUMBER(BN32),ISNUMBER(BO32),ISNUMBER(BG32),ISNUMBER(BK32)),SUM(BL32,BM32,BN32,BO32,('TT 1'!AR33*0.3),(ANNUAL!AR33*0.3)),\"\")","v":26.8},{"$f":"IF(ISNUMBER('UT1'!T34),'UT1'!T34,\"\")","v":67},{"$f":"IF(ISNUMBER('UT 2'!T34),'UT 2'!T34,\"\")","v":67},{"$f":"IF(ISNUMBER('UT 3 '!T34),'UT 3 '!T34,\"\")","v":67},{"$f":"IF('TT 1'!T34>0,'TT 1'!T34,\"\")","v":67},{"$f":"IF('UT 4'!T34>0,'UT 4'!T34,\"\")","v":67},{"$f":"IF('UT 5PB1'!T34>0,'UT 5PB1'!T34,\"\")","v":67},{"$f":"IF('PREANNU PB2 '!T34>0,'PREANNU PB2 '!T34,\"\")","v":67},{"$f":"IF(ANNUAL!T34>0,ANNUAL!T34,\"\")","v":67},6.7,6.7,6.7,6.7,{"$f":"IF(OR(ISNUMBER(BY32),ISNUMBER(BZ32),ISNUMBER(CA32),ISNUMBER(CB32),ISNUMBER(BT32),ISNUMBER(BX32)),SUM(BY32,BZ32,CA32,CB32,('TT 1'!BE33*0.3),(ANNUAL!BE33*0.3)),\"\")","v":26.8},{"$f":"IF(ISNUMBER('UT1'!W34),'UT1'!W34,\"\")","v":67},{"$f":"IF(ISNUMBER('UT 2'!W34),'UT 2'!W34,\"\")","v":67},{"$f":"IF(ISNUMBER('UT 3 '!W34),'UT 3 '!W34,\"\")","v":67},{"$f":"IF('TT 1'!W34>0,'TT 1'!W34,\"\")","v":67},{"$f":"IF('UT 4'!W34>0,'UT 4'!W34,\"\")","v":67},{"$f":"IF('UT 5PB1'!W34>0,'UT 5PB1'!W34,\"\")","v":67},{"$f":"IF('PREANNU PB2 '!W34>0,'PREANNU PB2 '!W34,\"\")","v":67},{"$f":"IF(ANNUAL!W34>0,ANNUAL!W34,\"\")","v":67},6.7,6.7,6.7,6.7,{"$f":"IF(OR(ISNUMBER(CL32),ISNUMBER(CM32),ISNUMBER(CN32),ISNUMBER(CO32),ISNUMBER(CG32),ISNUMBER(CK32)),SUM(CL32,CM32,CN32,CO32,('TT 1'!BR33*0.3),(ANNUAL!BR33*0.3)),\"\")","v":26.8},35.799999999999997,59.199999999999996,48.4,26.8,26.8,26.8,26.8,250.60000000000005,{"$f":"CX32/'Student Profile'!P33","v":50.120000000000012},32]
[{"$f":"ANNUAL!A35","v":""},{"$f":"ANNUAL!B35","v":""},{"$f":"IF('Student Profile'!D34>0,'Student Profile'!D34,\"\")","v":""},{"$f":"IF(ISNUMBER('UT1'!E35),'UT1'!E35,\"\")","v":82},{"$f":"IF(ISNUMBER('UT 2'!E35),'UT 2'!E35,\"\")","v":82},{"$f":"IF(ISNUMBER('UT 3 '!E35),'UT 3 '!E35,\"\")","v":82},{"$f":"IF('TT 1'!E35>0,'TT 1'!E35,\"\")","v":55},{"$f":"IF('UT 4'!E35>0,'UT 4'!E35,\"\")","v":82},{"$f":"IF('UT 5PB1'!E35>0,'UT 5PB1'!E35,\"\")","v":82},{"$f":"IF('PREANNU PB2 '!E35>0,'PREANNU PB2 '!E35,\"\")","v":82},{"$f":"IF(ANNUAL!E35>0,ANNUAL!E35,\"\")","v":49},8.1999999999999993,8.1999999999999993,8.1999999999999993,8.1999999999999993,{"$f":"IF(OR(ISNUMBER(L33),ISNUMBER(M33),ISNUMBER(N33),ISNUMBER(O33),ISNUMBER(G33),ISNUMBER(K33)),SUM(L33,M33,N33,O33,('TT 1'!D34*0.3),(ANNUAL!D34*0.3)),\"\")","v":41.8},{"$f":"IF(ISNUMBER('UT1'!H35),'UT1'!H35,\"\")","v":49},{"$f":"IF(ISNUMBER('UT 2'!H35),'UT 2'!H35,\"\")","v":82},{"$f":"IF(ISNUMBER('UT 3 '!H35),'UT 3 '!H35,\"\")","v":82},{"$f":"IF('TT 1'!H35>0,'TT 1'!H35,\"\")","v":82},{"$f":"IF('UT 4'!H35>0,'UT 4'!H35,\"\")","v":82},{"$f":"IF('UT 5PB1'!H35>0,'UT 5PB1'!H35,\"\")","v":82},{"$f":"IF('PREANNU PB2 '!H35>0,'PREANNU PB2 '!H35,\"\")","v":82},{"$f":"IF(ANNUAL!H35>0,ANNUAL!H35,\"\")","v":82},8.1999999999999993,8.1999999999999993,8.1999999999999993,8.1999999999999993,{"$f":"IF(OR(ISNUMBER(Y33),ISNUMBER(Z33),ISNUMBER(AA33),ISNUMBER(AB33),ISNUMBER(T33),ISNUMBER(X33)),SUM(Y33,Z33,AA33,AB33,('TT 1'!E34*0.3),(ANNUAL!E34*0.3)),\"\")","v":58.3},{"$f":"IF(ISNUMBER('UT1'!K35),'UT1'!K35,\"\")","v":82},{"$f":"IF(ISNUMBER('UT 2'!K35),'UT 2'!K35,\"\")","v":82},{"$f":"IF(ISNUMBER('UT 3 '!K35),'UT 3 '!K35,\"\")","v":82},{"$f":"IF('TT 1'!K35>0,'TT 1'!K35,\"\")","v":82},{"$f":"IF('UT 4'!K35>0,'UT 4'!K35,\"\")","v":82},{"$f":"IF('UT 5PB1'!K35>0,'UT 5PB1'!K35,\"\")","v":82},{"$f":"IF('PREANNU PB2 '!K35>0,'PREANNU PB2 '!K35,\"\")","v":82},{"$f":"IF(ANNUAL!K35>0,ANNUAL!K35,\"\")","v":82},8.1999999999999993,8.1999999999999993,8.1999999999999993,8.1999999999999993,{"$f":"IF(OR(ISNUMBER(AL33),ISNUMBER(AM33),ISNUMBER(AN33),ISNUMBER(AO33),ISNUMBER(AG33),ISNUMBER(AK33)),SUM(AL33,AM33,AN33,AO33,('TT 1'!R34*0.3),(ANNUAL!R34*0.3)),\"\")","v":47.8},{"$f":"IF(ISNUMBER('UT1'!N35),'UT1'!N35,\"\")","v":82},{"$f":"IF(ISNUMBER('UT 2'!N35),'UT 2'!N35,\"\")","v":82},{"$f":"IF(ISNUMBER('UT 3 '!N35),'UT 3 '!N35,\"\")","v":82},{"$f":"IF('TT 1'!N35>0,'TT 1'!N35,\"\")","v":82},{"$f":"IF('UT 4'!N35>0,'UT 4'!N35,\"\")","v":82},{"$f":"IF('UT 5PB1'!N35>0,'UT 5PB1'!N35,\"\")","v":82},{"$f":"IF('PREANNU PB2 '!N35>0,'PREANNU PB2 '!N35,\"\")","v":82},{"$f":"IF(ANNUAL!N35>0,ANNUAL!N35,\"\")","v":82},8.1999999999999993,8.1999999999999993,8.1999999999999993,8.1999999999999993,{"$f":"IF(OR(ISNUMBER(AY33),ISNUMBER(AZ33),ISNUMBER(BA33),ISNUMBER(BB33),ISNUMBER(AT33),ISNUMBER(AX33)),SUM(AY33,AZ33,BA33,BB33,('TT 1'!AE34*0.3),(ANNUAL!AE34*0.3)),\"\")","v":32.799999999999997},{"$f":"IF(ISNUMBER('UT1'!Q35),'UT1'!Q35,\"\")","v":82},{"$f":"IF(ISNUMBER('UT 2'!Q35),'UT 2'!Q35,\"\")","v":82},{"$f":"IF(ISNUMBER('UT 3 '!Q35),'UT 3 '!Q35,\"\")","v":82},{"$f":"IF('TT 1'!Q35>0,'TT 1'!Q35,\"\")","v":82},{"$f":"IF('UT 4'!Q35>0,'UT 4'!Q35,\"\")","v":82},{"$f":"IF('UT 5PB1'!Q35>0,'UT 5PB1'!Q35,\"\")","v":82},{"$f":"IF('PREANNU PB2 '!Q35>0,'PREANNU PB2 '!Q35,\"\")","v":82},{"$f":"IF(ANNUAL!Q35>0,ANNUAL!Q35,\"\")","v":82},8.1999999999999993,8.1999999999999993,8.1999999999999993,8.1999999999999993,{"$f":"IF(OR(ISNUMBER(BL33),ISNUMBER(BM33),ISNUMBER(BN33),ISNUMBER(BO33),ISNUMBER(BG33),ISNUMBER(BK33)),SUM(BL33,BM33,BN33,BO33,('TT 1'!AR34*0.3),(ANNUAL!AR34*0.3)),\"\")","v":32.799999999999997},{"$f":"IF(ISNUMBER('UT1'!T35),'UT1'!T35,\"\")","v":82},{"$f":"IF(ISNUMBER('UT 2'!T35),'UT 2'!T35,\"\")","v":82},{"$f":"IF(ISNUMBER('UT 3 '!T35),'UT 3 '!T35,\"\")","v":82},{"$f":"IF('TT 1'!T35>0,'TT 1'!T35,\"\")","v":82},{"$f":"IF('UT 4'!T35>0,'UT 4'!T35,\"\")","v":82},{"$f":"IF('UT 5PB1'!T35>0,'UT 5PB1'!T35,\"\")","v":82},{"$f":"IF('PREANNU PB2 '!T35>0,'PREANNU PB2 '!T35,\"\")","v":82},{"$f":"IF(ANNUAL!T35>0,ANNUAL!T35,\"\")","v":82},8.1999999999999993,8.1999999999999993,8.1999999999999993,8.1999999999999993,{"$f":"IF(OR(ISNUMBER(BY33),ISNUMBER(BZ33),ISNUMBER(CA33),ISNUMBER(CB33),ISNUMBER(BT33),ISNUMBER(BX33)),SUM(BY33,BZ33,CA33,CB33,('TT 1'!BE34*0.3),(ANNUAL!BE34*0.3)),\"\")","v":32.799999999999997},{"$f":"IF(ISNUMBER('UT1'!W35),'UT1'!W35,\"\")","v":82},{"$f":"IF(ISNUMBER('UT 2'!W35),'UT 2'!W35,\"\")","v":82},{"$f":"IF(ISNUMBER('UT 3 '!W35),'UT 3 '!W35,\"\")","v":82},{"$f":"IF('TT 1'!W35>0,'TT 1'!W35,\"\")","v":82},{"$f":"IF('UT 4'!W35>0,'UT 4'!W35,\"\")","v":82},{"$f":"IF('UT 5PB1'!W35>0,'UT 5PB1'!W35,\"\")","v":82},{"$f":"IF('PREANNU PB2 '!W35>0,'PREANNU PB2 '!W35,\"\")","v":82},{"$f":"IF(ANNUAL!W35>0,ANNUAL!W35,\"\")","v":82},8.1999999999999993,8.1999999999999993,8.1999999999999993,8.1999999999999993,{"$f":"IF(OR(ISNUMBER(CL33),ISNUMBER(CM33),ISNUMBER(CN33),ISNUMBER(CO33),ISNUMBER(CG33),ISNUMBER(CK33)),SUM(CL33,CM33,CN33,CO33,('TT 1'!BR34*0.3),(ANNUAL!BR34*0.3)),\"\")","v":32.799999999999997},41.8,58.3,47.8,32.799999999999997,32.799999999999997,32.799999999999997,32.799999999999997,279.10000000000002,{"$f":"CX33/'Student Profile'!P34","v":55.820000000000007},14]
[{"$f":"ANNUAL!A36","v":""},{"$f":"ANNUAL!B36","v":""},{"$f":"IF('Student Profile'!D35>0,'Student Profile'!D35,\"\")","v":""},{"$f":"IF(ISNUMBER('UT1'!E36),'UT1'!E36,\"\")","v":77},{"$f":"IF(ISNUMBER('UT 2'!E36),'UT 2'!E36,\"\")","v":77},{"$f":"IF(ISNUMBER('UT 3 '!E36),'UT 3 '!E36,\"\")","v":77},{"$f":"IF('TT 1'!E36>0,'TT 1'!E36,\"\")","v":52},{"$f":"IF('UT 4'!E36>0,'UT 4'!E36,\"\")","v":77},{"$f":"IF('UT 5PB1'!E36>0,'UT 5PB1'!E36,\"\")","v":77},{"$f":"IF('PREANNU PB2 '!E36>0,'PREANNU PB2 '!E36,\"\")","v":77},{"$f":"IF(ANNUAL!E36>0,ANNUAL!E36,\"\")","v":46},7.7,7.7,7.7,7.7,{"$f":"IF(OR(ISNUMBER(L34),ISNUMBER(M34),ISNUMBER(N34),ISNUMBER(O34),ISNUMBER(G34),ISNUMBER(K34)),SUM(L34,M34,N34,O34,('TT 1'!D35*0.3),(ANNUAL!D35*0.3)),\"\")","v":39.799999999999997},{"$f":"IF(ISNUMBER('UT1'!H36),'UT1'!H36,\"\")","v":46},{"$f":"IF(ISNUMBER('UT 2'!H36),'UT 2'!H36,\"\")","v":77},{"$f":"IF(ISNUMBER('UT 3 '!H36),'UT 3 '!H36,\"\")","v":77},{"$f":"IF('TT 1'!H36>0,'TT 1'!H36,\"\")","v":77},{"$f":"IF('UT 4'!H36>0,'UT 4'!H36,\"\")","v":77},{"$f":"IF('UT 5PB1'!H36>0,'UT 5PB1'!H36,\"\")","v":77},{"$f":"IF('PREANNU PB2 '!H36>0,'PREANNU PB2 '!H36,\"\")","v":77},{"$f":"IF(ANNUAL!H36>0,ANNUAL!H36,\"\")","v":77},7.7,7.7,7.7,7.7,{"$f":"IF(OR(ISNUMBER(Y34),ISNUMBER(Z34),ISNUMBER(AA34),ISNUMBER(AB34),ISNUMBER(T34),ISNUMBER(X34)),SUM(Y34,Z34,AA34,AB34,('TT 1'!E35*0.3),(ANNUAL!E35*0.3)),\"\")","v":62},{"$f":"IF(ISNUMBER('UT1'!K36),'UT1'!K36,\"\")","v":77},{"$f":"IF(ISNUMBER('UT 2'!K36),'UT 2'!K36,\"\")","v":77},{"$f":"IF(ISNUMBER('UT 3 '!K36),'UT 3 '!K36,\"\")","v":77},{"$f":"IF('TT 1'!K36>0,'TT 1'!K36,\"\")","v":77},{"$f":"IF('UT 4'!K36>0,'UT 4'!K36,\"\")","v":77},{"$f":"IF('UT 5PB1'!K36>0,'UT 5PB1'!K36,\"\")","v":77},{"$f":"IF('PREANNU PB2 '!K36>0,'PREANNU PB2 '!K36,\"\")","v":77},{"$f":"IF(ANNUAL!K36>0,ANNUAL!K36,\"\")","v":77},7.7,7.7,7.7,7.7,{"$f":"IF(OR(ISNUMBER(AL34),ISNUMBER(AM34),ISNUMBER(AN34),ISNUMBER(AO34),ISNUMBER(AG34),ISNUMBER(AK34)),SUM(AL34,AM34,AN34,AO34,('TT 1'!R35*0.3),(ANNUAL!R35*0.3)),\"\")","v":51.2},{"$f":"IF(ISNUMBER('UT1'!N36),'UT1'!N36,\"\")","v":77},{"$f":"IF(ISNUMBER('UT 2'!N36),'UT 2'!N36,\"\")","v":77},{"$f":"IF(ISNUMBER('UT 3 '!N36),'UT 3 '!N36,\"\")","v":77},{"$f":"IF('TT 1'!N36>0,'TT 1'!N36,\"\")","v":77},{"$f":"IF('UT 4'!N36>0,'UT 4'!N36,\"\")","v":77},{"$f":"IF('UT 5PB1'!N36>0,'UT 5PB1'!N36,\"\")","v":77},{"$f":"IF('PREANNU PB2 '!N36>0,'PREANNU PB2 '!N36,\"\")","v":77},{"$f":"IF(ANNUAL!N36>0,ANNUAL!N36,\"\")","v":77},7.7,7.7,7.7,7.7,{"$f":"IF(OR(ISNUMBER(AY34),ISNUMBER(AZ34),ISNUMBER(BA34),ISNUMBER(BB34),ISNUMBER(AT34),ISNUMBER(AX34)),SUM(AY34,AZ34,BA34,BB34,('TT 1'!AE35*0.3),(ANNUAL!AE35*0.3)),\"\")","v":30.8},{"$f":"IF(ISNUMBER('UT1'!Q36),'UT1'!Q36,\"\")","v":77},{"$f":"IF(ISNUMBER('UT 2'!Q36),'UT 2'!Q36,\"\")","v":77},{"$f":"IF(ISNUMBER('UT 3 '!Q36),'UT 3 '!Q36,\"\")","v":77},{"$f":"IF('TT 1'!Q36>0,'TT 1'!Q36,\"\")","v":77},{"$f":"IF('UT 4'!Q36>0,'UT 4'!Q36,\"\")","v":77},{"$f":"IF('UT 5PB1'!Q36>0,'UT 5PB1'!Q36,\"\")","v":77},{"$f":"IF('PREANNU PB2 '!Q36>0,'PREANNU PB2 '!Q36,\"\")","v":77},{"$f":"IF(ANNUAL!Q36>0,ANNUAL!Q36,\"\")","v":77},7.7,7.7,7.7,7.7,{"$f":"IF(OR(ISNUMBER(BL34),ISNUMBER(BM34),ISNUMBER(BN34),ISNUMBER(BO34),ISNUMBER(BG34),ISNUMBER(BK34)),SUM(BL34,BM34,BN34,BO34,('TT 1'!AR35*0.3),(ANNUAL!AR35*0.3)),\"\")","v":30.8},{"$f":"IF(ISNUMBER('UT1'!T36),'UT1'!T36,\"\")","v":77},{"$f":"IF(ISNUMBER('UT 2'!T36),'UT 2'!T36,\"\")","v":77},{"$f":"IF(ISNUMBER('UT 3 '!T36),'UT 3 '!T36,\"\")","v":77},{"$f":"IF('TT 1'!T36>0,'TT 1'!T36,\"\")","v":77},{"$f":"IF('UT 4'!T36>0,'UT 4'!T36,\"\")","v":77},{"$f":"IF('UT 5PB1'!T36>0,'UT 5PB1'!T36,\"\")","v":77},{"$f":"IF('PREANNU PB2 '!T36>0,'PREANNU PB2 '!T36,\"\")","v":77},{"$f":"IF(ANNUAL!T36>0,ANNUAL!T36,\"\")","v":77},7.7,7.7,7.7,7.7,{"$f":"IF(OR(ISNUMBER(BY34),ISNUMBER(BZ34),ISNUMBER(CA34),ISNUMBER(CB34),ISNUMBER(BT34),ISNUMBER(BX34)),SUM(BY34,BZ34,CA34,CB34,('TT 1'!BE35*0.3),(ANNUAL!BE35*0.3)),\"\")","v":30.8},{"$f":"IF(ISNUMBER('UT1'!W36),'UT1'!W36,\"\")","v":77},{"$f":"IF(ISNUMBER('UT 2'!W36),'UT 2'!W36,\"\")","v":77},{"$f":"IF(ISNUMBER('UT 3 '!W36),'UT 3 '!W36,\"\")","v":77},{"$f":"IF('TT 1'!W36>0,'TT 1'!W36,\"\")","v":77},{"$f":"IF('UT 4'!W36>0,'UT 4'!W36,\"\")","v":77},{"$f":"IF('UT 5PB1'!W36>0,'UT 5PB1'!W36,\"\")","v":77},{"$f":"IF('PREANNU PB2 '!W36>0,'PREANNU PB2 '!W36,\"\")","v":77},{"$f":"IF(ANNUAL!W36>0,ANNUAL!W36,\"\")","v":77},7.7,7.7,7.7,7.7,{"$f":"IF(OR(ISNUMBER(CL34),ISNUMBER(CM34),ISNUMBER(CN34),ISNUMBER(CO34),ISNUMBER(CG34),ISNUMBER(CK34)),SUM(CL34,CM34,CN34,CO34,('TT 1'!BR35*0.3),(ANNUAL!BR35*0.3)),\"\")","v":30.8},39.799999999999997,62,51.2,30.8,30.8,30.8,30.8,276.20000000000005,{"$f":"CX34/'Student Profile'!P35","v":55.240000000000009},19]
[{"$f":"ANNUAL!A37","v":""},{"$f":"ANNUAL!B37","v":""},{"$f":"IF('Student Profile'!D36>0,'Student Profile'!D36,\"\")","v":""},{"$f":"IF(ISNUMBER('UT1'!E37),'UT1'!E37,\"\")","v":74},{"$f":"IF(ISNUMBER('UT 2'!E37),'UT 2'!E37,\"\")","v":74},{"$f":"IF(ISNUMBER('UT 3 '!E37),'UT 3 '!E37,\"\")","v":74},{"$f":"IF('TT 1'!E37>0,'TT 1'!E37,\"\")","v":49},{"$f":"IF('UT 4'!E37>0,'UT 4'!E37,\"\")","v":74},{"$f":"IF('UT 5PB1'!E37>0,'UT 5PB1'!E37,\"\")","v":74},{"$f":"IF('PREANNU PB2 '!E37>0,'PREANNU PB2 '!E37,\"\")","v":74},{"$f":"IF(ANNUAL!E37>0,ANNUAL!E37,\"\")","v":44},7.4,7.4,7.4,7.4,{"$f":"IF(OR(ISNUMBER(L35),ISNUMBER(M35),ISNUMBER(N35),ISNUMBER(O35),ISNUMBER(G35),ISNUMBER(K35)),SUM(L35,M35,N35,O35,('TT 1'!D36*0.3),(ANNUAL!D36*0.3)),\"\")","v":40.4},{"$f":"IF(ISNUMBER('UT1'!H37),'UT1'!H37,\"\")","v":44},{"$f":"IF(ISNUMBER('UT 2'!H37),'UT 2'!H37,\"\")","v":74},{"$f":"IF(ISNUMBER('UT 3 '!H37),'UT 3 '!H37,\"\")","v":74},{"$f":"IF('TT 1'!H37>0,'TT 1'!H37,\"\")","v":74},{"$f":"IF('UT 4'!H37>0,'UT 4'!H37,\"\")","v":74},{"$f":"IF('UT 5PB1'!H37>0,'UT 5PB1'!H37,\"\")","v":74},{"$f":"IF('PREANNU PB2 '!H37>0,'PREANNU PB2 '!H37,\"\")","v":74},{"$f":"IF(ANNUAL!H37>0,ANNUAL!H37,\"\")","v":74},7.4,7.4,7.4,7.4,{"$f":"IF(OR(ISNUMBER(Y35),ISNUMBER(Z35),ISNUMBER(AA35),ISNUMBER(AB35),ISNUMBER(T35),ISNUMBER(X35)),SUM(Y35,Z35,AA35,AB35,('TT 1'!E36*0.3),(ANNUAL!E36*0.3)),\"\")","v":59},{"$f":"IF(ISNUMBER('UT1'!K37),'UT1'!K37,\"\")","v":74},{"$f":"IF(ISNUMBER('UT 2'!K37),'UT 2'!K37,\"\")","v":74},{"$f":"IF(ISNUMBER('UT 3 '!K37),'UT 3 '!K37,\"\")","v":74},{"$f":"IF('TT 1'!K37>0,'TT 1'!K37,\"\")","v":74},{"$f":"IF('UT 4'!K37>0,'UT 4'!K37,\"\")","v":74},{"$f":"IF('UT 5PB1'!K37>0,'UT 5PB1'!K37,\"\")","v":74},{"$f":"IF('PREANNU PB2 '!K37>0,'PREANNU PB2 '!K37,\"\")","v":74},{"$f":"IF(ANNUAL!K37>0,ANNUAL!K37,\"\")","v":74},7.4,7.4,7.4,7.4,{"$f":"IF(OR(ISNUMBER(AL35),ISNUMBER(AM35),ISNUMBER(AN35),ISNUMBER(AO35),ISNUMBER(AG35),ISNUMBER(AK35)),SUM(AL35,AM35,AN35,AO35,('TT 1'!R36*0.3),(ANNUAL!R36*0.3)),\"\")","v":46.4},{"$f":"IF(ISNUMBER('UT1'!N37),'UT1'!N37,\"\")","v":74},{"$f":"IF(ISNUMBER('UT 2'!N37),'UT 2'!N37,\"\")","v":74},{"$f":"IF(ISNUMBER('UT 3 '!N37),'UT 3 '!N37,\"\")","v":74},{"$f":"IF('TT 1'!N37>0,'TT 1'!N37,\"\")","v":74},{"$f":"IF('UT 4'!N37>0,'UT 4'!N37,\"\")","v":74},{"$f":"IF('UT 5PB1'!N37>0,'UT 5PB1'!N37,\"\")","v":74},{"$f":"IF('PREANNU PB2 '!N37>0,'PREANNU PB2 '!N37,\"\")","v":74},{"$f":"IF(ANNUAL!N37>0,ANNUAL!N37,\"\")","v":74},7.4,7.4,7.4,7.4,{"$f":"IF(OR(ISNUMBER(AY35),ISNUMBER(AZ35),ISNUMBER(BA35),ISNUMBER(BB35),ISNUMBER(AT35),ISNUMBER(AX35)),SUM(AY35,AZ35,BA35,BB35,('TT 1'!AE36*0.3),(ANNUAL!AE36*0.3)),\"\")","v":29.6},{"$f":"IF(ISNUMBER('UT1'!Q37),'UT1'!Q37,\"\")","v":74},{"$f":"IF(ISNUMBER('UT 2'!Q37),'UT 2'!Q37,\"\")","v":74},{"$f":"IF(ISNUMBER('UT 3 '!Q37),'UT 3 '!Q37,\"\")","v":74},{"$f":"IF('TT 1'!Q37>0,'TT 1'!Q37,\"\")","v":74},{"$f":"IF('UT 4'!Q37>0,'UT 4'!Q37,\"\")","v":74},{"$f":"IF('UT 5PB1'!Q37>0,'UT 5PB1'!Q37,\"\")","v":74},{"$f":"IF('PREANNU PB2 '!Q37>0,'PREANNU PB2 '!Q37,\"\")","v":74},{"$f":"IF(ANNUAL!Q37>0,ANNUAL!Q37,\"\")","v":74},7.4,7.4,7.4,7.4,{"$f":"IF(OR(ISNUMBER(BL35),ISNUMBER(BM35),ISNUMBER(BN35),ISNUMBER(BO35),ISNUMBER(BG35),ISNUMBER(BK35)),SUM(BL35,BM35,BN35,BO35,('TT 1'!AR36*0.3),(ANNUAL!AR36*0.3)),\"\")","v":29.6},{"$f":"IF(ISNUMBER('UT1'!T37),'UT1'!T37,\"\")","v":74},{"$f":"IF(ISNUMBER('UT 2'!T37),'UT 2'!T37,\"\")","v":74},{"$f":"IF(ISNUMBER('UT 3 '!T37),'UT 3 '!T37,\"\")","v":74},{"$f":"IF('TT 1'!T37>0,'TT 1'!T37,\"\")","v":74},{"$f":"IF('UT 4'!T37>0,'UT 4'!T37,\"\")","v":74},{"$f":"IF('UT 5PB1'!T37>0,'UT 5PB1'!T37,\"\")","v":74},{"$f":"IF('PREANNU PB2 '!T37>0,'PREANNU PB2 '!T37,\"\")","v":74},{"$f":"IF(ANNUAL!T37>0,ANNUAL!T37,\"\")","v":74},7.4,7.4,7.4,7.4,{"$f":"IF(OR(ISNUMBER(BY35),ISNUMBER(BZ35),ISNUMBER(CA35),ISNUMBER(CB35),ISNUMBER(BT35),ISNUMBER(BX35)),SUM(BY35,BZ35,CA35,CB35,('TT 1'!BE36*0.3),(ANNUAL!BE36*0.3)),\"\")","v":29.6},{"$f":"IF(ISNUMBER('UT1'!W37),'UT1'!W37,\"\")","v":74},{"$f":"IF(ISNUMBER('UT 2'!W37),'UT 2'!W37,\"\")","v":74},{"$f":"IF(ISNUMBER('UT 3 '!W37),'UT 3 '!W37,\"\")","v":74},{"$f":"IF('TT 1'!W37>0,'TT 1'!W37,\"\")","v":74},{"$f":"IF('UT 4'!W37>0,'UT 4'!W37,\"\")","v":74},{"$f":"IF('UT 5PB1'!W37>0,'UT 5PB1'!W37,\"\")","v":74},{"$f":"IF('PREANNU PB2 '!W37>0,'PREANNU PB2 '!W37,\"\")","v":74},{"$f":"IF(ANNUAL!W37>0,ANNUAL!W37,\"\")","v":74},7.4,7.4,7.4,7.4,{"$f":"IF(OR(ISNUMBER(CL35),ISNUMBER(CM35),ISNUMBER(CN35),ISNUMBER(CO35),ISNUMBER(CG35),ISNUMBER(CK35)),SUM(CL35,CM35,CN35,CO35,('TT 1'!BR36*0.3),(ANNUAL!BR36*0.3)),\"\")","v":29.6},40.4,59,46.4,29.6,29.6,29.6,29.6,264.2,{"$f":"CX35/'Student Profile'!P36","v":52.839999999999996},24]
[{"$f":"ANNUAL!A38","v":""},{"$f":"ANNUAL!B38","v":""},{"$f":"IF('Student Profile'!D37>0,'Student Profile'!D37,\"\")","v":""},{"$f":"IF(ISNUMBER('UT1'!E38),'UT1'!E38,\"\")","v":50},{"$f":"IF(ISNUMBER('UT 2'!E38),'UT 2'!E38,\"\")","v":50},{"$f":"IF(ISNUMBER('UT 3 '!E38),'UT 3 '!E38,\"\")","v":50},{"$f":"IF('TT 1'!E38>0,'TT 1'!E38,\"\")","v":34},{"$f":"IF('UT 4'!E38>0,'UT 4'!E38,\"\")","v":50},{"$f":"IF('UT 5PB1'!E38>0,'UT 5PB1'!E38,\"\")","v":50},{"$f":"IF('PREANNU PB2 '!E38>0,'PREANNU PB2 '!E38,\"\")","v":50},{"$f":"IF(ANNUAL!E38>0,ANNUAL!E38,\"\")","v":30},5,5,5,5,{"$f":"IF(OR(ISNUMBER(L36),ISNUMBER(M36),ISNUMBER(N36),ISNUMBER(O36),ISNUMBER(G36),ISNUMBER(K36)),SUM(L36,M36,N36,O36,('TT 1'!D37*0.3),(ANNUAL!D37*0.3)),\"\")","v":29},{"$f":"IF(ISNUMBER('UT1'!H38),'UT1'!H38,\"\")","v":30},{"$f":"IF(ISNUMBER('UT 2'!H38),'UT 2'!H38,\"\")","v":50},{"$f":"IF(ISNUMBER('UT 3 '!H38),'UT 3 '!H38,\"\")","v":50},{"$f":"IF('TT 1'!H38>0,'TT 1'!H38,\"\")","v":50},{"$f":"IF('UT 4'!H38>0,'UT 4'!H38,\"\")","v":50},{"$f":"IF('UT 5PB1'!H38>0,'UT 5PB1'!H38,\"\")","v":50},{"$f":"IF('PREANNU PB2 '!H38>0,'PREANNU PB2 '!H38,\"\")","v":50},{"$f":"IF(ANNUAL!H38>0,ANNUAL!H38,\"\")","v":50},5,5,5,5,{"$f":"IF(OR(ISNUMBER(Y36),ISNUMBER(Z36),ISNUMBER(AA36),ISNUMBER(AB36),ISNUMBER(T36),ISNUMBER(X36)),SUM(Y36,Z36,AA36,AB36,('TT 1'!E37*0.3),(ANNUAL!E37*0.3)),\"\")","v":47.900000000000006},{"$f":"IF(ISNUMBER('UT1'!K38),'UT1'!K38,\"\")","v":50},{"$f":"IF(ISNUMBER('UT 2'!K38),'UT 2'!K38,\"\")","v":50},{"$f":"IF(ISNUMBER('UT 3 '!K38),'UT 3 '!K38,\"\")","v":50},{"$f":"IF('TT 1'!K38>0,'TT 1'!K38,\"\")","v":50},{"$f":"IF('UT 4'!K38>0,'UT 4'!K38,\"\")","v":50},{"$f":"IF('UT 5PB1'!K38>0,'UT 5PB1'!K38,\"\")","v":50},{"$f":"IF('PREANNU PB2 '!K38>0,'PREANNU PB2 '!K38,\"\")","v":50},{"$f":"IF(ANNUAL!K38>0,ANNUAL!K38,\"\")","v":50},5,5,5,5,{"$f":"IF(OR(ISNUMBER(AL36),ISNUMBER(AM36),ISNUMBER(AN36),ISNUMBER(AO36),ISNUMBER(AG36),ISNUMBER(AK36)),SUM(AL36,AM36,AN36,AO36,('TT 1'!R37*0.3),(ANNUAL!R37*0.3)),\"\")","v":37.4},{"$f":"IF(ISNUMBER('UT1'!N38),'UT1'!N38,\"\")","v":50},{"$f":"IF(ISNUMBER('UT 2'!N38),'UT 2'!N38,\"\")","v":50},{"$f":"IF(ISNUMBER('UT 3 '!N38),'UT 3 '!N38,\"\")","v":50},{"$f":"IF('TT 1'!N38>0,'TT 1'!N38,\"\")","v":50},{"$f":"IF('UT 4'!N38>0,'UT 4'!N38,\"\")","v":50},{"$f":"IF('UT 5PB1'!N38>0,'UT 5PB1'!N38,\"\")","v":50},{"$f":"IF('PREANNU PB2 '!N38>0,'PREANNU PB2 '!N38,\"\")","v":50},{"$f":"IF(ANNUAL!N38>0,ANNUAL!N38,\"\")","v":50},5,5,5,5,{"$f":"IF(OR(ISNUMBER(AY36),ISNUMBER(AZ36),ISNUMBER(BA36),ISNUMBER(BB36),ISNUMBER(AT36),ISNUMBER(AX36)),SUM(AY36,AZ36,BA36,BB36,('TT 1'!AE37*0.3),(ANNUAL!AE37*0.3)),\"\")","v":20},{"$f":"IF(ISNUMBER('UT1'!Q38),'UT1'!Q38,\"\")","v":50},{"$f":"IF(ISNUMBER('UT 2'!Q38),'UT 2'!Q38,\"\")","v":50},{"$f":"IF(ISNUMBER('UT 3 '!Q38),'UT 3 '!Q38,\"\")","v":50},{"$f":"IF('TT 1'!Q38>0,'TT 1'!Q38,\"\")","v":50},{"$f":"IF('UT 4'!Q38>0,'UT 4'!Q38,\"\")","v":50},{"$f":"IF('UT 5PB1'!Q38>0,'UT 5PB1'!Q38,\"\")","v":50},{"$f":"IF('PREANNU PB2 '!Q38>0,'PREANNU PB2 '!Q38,\"\")","v":50},{"$f":"IF(ANNUAL!Q38>0,ANNUAL!Q38,\"\")","v":50},5,5,5,5,{"$f":"IF(OR(ISNUMBER(BL36),ISNUMBER(BM36),ISNUMBER(BN36),ISNUMBER(BO36),ISNUMBER(BG36),ISNUMBER(BK36)),SUM(BL36,BM36,BN36,BO36,('TT 1'!AR37*0.3),(ANNUAL!AR37*0.3)),\"\")","v":20},{"$f":"IF(ISNUMBER('UT1'!T38),'UT1'!T38,\"\")","v":50},{"$f":"IF(ISNUMBER('UT 2'!T38),'UT 2'!T38,\"\")","v":50},{"$f":"IF(ISNUMBER('UT 3 '!T38),'UT 3 '!T38,\"\")","v":50},{"$f":"IF('TT 1'!T38>0,'TT 1'!T38,\"\")","v":50},{"$f":"IF('UT 4'!T38>0,'UT 4'!T38,\"\")","v":50},{"$f":"IF('UT 5PB1'!T38>0,'UT 5PB1'!T38,\"\")","v":50},{"$f":"IF('PREANNU PB2 '!T38>0,'PREANNU PB2 '!T38,\"\")","v":50},{"$f":"IF(ANNUAL!T38>0,ANNUAL!T38,\"\")","v":50},5,5,5,5,{"$f":"IF(OR(ISNUMBER(BY36),ISNUMBER(BZ36),ISNUMBER(CA36),ISNUMBER(CB36),ISNUMBER(BT36),ISNUMBER(BX36)),SUM(BY36,BZ36,CA36,CB36,('TT 1'!BE37*0.3),(ANNUAL!BE37*0.3)),\"\")","v":20},{"$f":"IF(ISNUMBER('UT1'!W38),'UT1'!W38,\"\")","v":50},{"$f":"IF(ISNUMBER('UT 2'!W38),'UT 2'!W38,\"\")","v":50},{"$f":"IF(ISNUMBER('UT 3 '!W38),'UT 3 '!W38,\"\")","v":50},{"$f":"IF('TT 1'!W38>0,'TT 1'!W38,\"\")","v":50},{"$f":"IF('UT 4'!W38>0,'UT 4'!W38,\"\")","v":50},{"$f":"IF('UT 5PB1'!W38>0,'UT 5PB1'!W38,\"\")","v":50},{"$f":"IF('PREANNU PB2 '!W38>0,'PREANNU PB2 '!W38,\"\")","v":50},{"$f":"IF(ANNUAL!W38>0,ANNUAL!W38,\"\")","v":50},5,5,5,5,{"$f":"IF(OR(ISNUMBER(CL36),ISNUMBER(CM36),ISNUMBER(CN36),ISNUMBER(CO36),ISNUMBER(CG36),ISNUMBER(CK36)),SUM(CL36,CM36,CN36,CO36,('TT 1'!BR37*0.3),(ANNUAL!BR37*0.3)),\"\")","v":20},29,47.900000000000006,37.4,20,20,20,20,194.3,{"$f":"CX36/'Student Profile'!P37","v":38.86},42]
[{"$f":"ANNUAL!A39","v":""},{"$f":"ANNUAL!B39","v":""},{"$f":"IF('Student Profile'!D38>0,'Student Profile'!D38,\"\")","v":""},{"$f":"IF(ISNUMBER('UT1'!E39),'UT1'!E39,\"\")","v":67},{"$f":"IF(ISNUMBER('UT 2'!E39),'UT 2'!E39,\"\")","v":67},{"$f":"IF(ISNUMBER('UT 3 '!E39),'UT 3 '!E39,\"\")","v":67},{"$f":"IF('TT 1'!E39>0,'TT 1'!E39,\"\")","v":45},{"$f":"IF('UT 4'!E39>0,'UT 4'!E39,\"\")","v":67},{"$f":"IF('UT 5PB1'!E39>0,'UT 5PB1'!E39,\"\")","v":67},{"$f":"IF('PREANNU PB2 '!E39>0,'PREANNU PB2 '!E39,\"\")","v":67},{"$f":"IF(ANNUAL!E39>0,ANNUAL!E39,\"\")","v":40},6.7,6.7,6.7,6.7,{"$f":"IF(OR(ISNUMBER(L37),ISNUMBER(M37),ISNUMBER(N37),ISNUMBER(O37),ISNUMBER(G37),ISNUMBER(K37)),SUM(L37,M37,N37,O37,('TT 1'!D38*0.3),(ANNUAL!D38*0.3)),\"\")","v":32.799999999999997},{"$f":"IF(ISNUMBER('UT1'!H39),'UT1'!H39,\"\")","v":40},{"$f":"IF(ISNUMBER('UT 2'!H39),'UT 2'!H39,\"\")","v":67},{"$f":"IF(ISNUMBER('UT 3 '!H39),'UT 3 '!H39,\"\")","v":67},{"$f":"IF('TT 1'!H39>0,'TT 1'!H39,\"\")","v":67},{"$f":"IF('UT 4'!H39>0,'UT 4'!H39,\"\")","v":67},{"$f":"IF('UT 5PB1'!H39>0,'UT 5PB1'!H39,\"\")","v":67},{"$f":"IF('PREANNU PB2 '!H39>0,'PREANNU PB2 '!H39,\"\")","v":67},{"$f":"IF(ANNUAL!H39>0,ANNUAL!H39,\"\")","v":67},6.7,6.7,6.7,6.7,{"$f":"IF(OR(ISNUMBER(Y37),ISNUMBER(Z37),ISNUMBER(AA37),ISNUMBER(AB37),ISNUMBER(T37),ISNUMBER(X37)),SUM(Y37,Z37,AA37,AB37,('TT 1'!E38*0.3),(ANNUAL!E38*0.3)),\"\")","v":46},{"$f":"IF(ISNUMBER('UT1'!K39),'UT1'!K39,\"\")","v":67},{"$f":"IF(ISNUMBER('UT 2'!K39),'UT 2'!K39,\"\")","v":67},{"$f":"IF(ISNUMBER('UT 3 '!K39),'UT 3 '!K39,\"\")","v":67},{"$f":"IF('TT 1'!K39>0,'TT 1'!K39,\"\")","v":67},{"$f":"IF('UT 4'!K39>0,'UT 4'!K39,\"\")","v":67},{"$f":"IF('UT 5PB1'!K39>0,'UT 5PB1'!K39,\"\")","v":67},{"$f":"IF('PREANNU PB2 '!K39>0,'PREANNU PB2 '!K39,\"\")","v":67},{"$f":"IF(ANNUAL!K39>0,ANNUAL!K39,\"\")","v":67},6.7,6.7,6.7,6.7,{"$f":"IF(OR(ISNUMBER(AL37),ISNUMBER(AM37),ISNUMBER(AN37),ISNUMBER(AO37),ISNUMBER(AG37),ISNUMBER(AK37)),SUM(AL37,AM37,AN37,AO37,('TT 1'!R38*0.3),(ANNUAL!R38*0.3)),\"\")","v":38.799999999999997},{"$f":"IF(ISNUMBER('UT1'!N39),'UT1'!N39,\"\")","v":67},{"$f":"IF(ISNUMBER('UT 2'!N39),'UT 2'!N39,\"\")","v":67},{"$f":"IF(ISNUMBER('UT 3 '!N39),'UT 3 '!N39,\"\")","v":67},{"$f":"IF('TT 1'!N39>0,'TT 1'!N39,\"\")","v":67},{"$f":"IF('UT 4'!N39>0,'UT 4'!N39,\"\")","v":67},{"$f":"IF('UT 5PB1'!N39>0,'UT 5PB1'!N39,\"\")","v":67},{"$f":"IF('PREANNU PB2 '!N39>0,'PREANNU PB2 '!N39,\"\")","v":67},{"$f":"IF(ANNUAL!N39>0,ANNUAL!N39,\"\")","v":67},6.7,6.7,6.7,6.7,{"$f":"IF(OR(ISNUMBER(AY37),ISNUMBER(AZ37),ISNUMBER(BA37),ISNUMBER(BB37),ISNUMBER(AT37),ISNUMBER(AX37)),SUM(AY37,AZ37,BA37,BB37,('TT 1'!AE38*0.3),(ANNUAL!AE38*0.3)),\"\")","v":26.8},{"$f":"IF(ISNUMBER('UT1'!Q39),'UT1'!Q39,\"\")","v":67},{"$f":"IF(ISNUMBER('UT 2'!Q39),'UT 2'!Q39,\"\")","v":67},{"$f":"IF(ISNUMBER('UT 3 '!Q39),'UT 3 '!Q39,\"\")","v":67},{"$f":"IF('TT 1'!Q39>0,'TT 1'!Q39,\"\")","v":67},{"$f":"IF('UT 4'!Q39>0,'UT 4'!Q39,\"\")","v":67},{"$f":"IF('UT 5PB1'!Q39>0,'UT 5PB1'!Q39,\"\")","v":67},{"$f":"IF('PREANNU PB2 '!Q39>0,'PREANNU PB2 '!Q39,\"\")","v":67},{"$f":"IF(ANNUAL!Q39>0,ANNUAL!Q39,\"\")","v":67},6.7,6.7,6.7,6.7,{"$f":"IF(OR(ISNUMBER(BL37),ISNUMBER(BM37),ISNUMBER(BN37),ISNUMBER(BO37),ISNUMBER(BG37),ISNUMBER(BK37)),SUM(BL37,BM37,BN37,BO37,('TT 1'!AR38*0.3),(ANNUAL!AR38*0.3)),\"\")","v":26.8},{"$f":"IF(ISNUMBER('UT1'!T39),'UT1'!T39,\"\")","v":67},{"$f":"IF(ISNUMBER('UT 2'!T39),'UT 2'!T39,\"\")","v":67},{"$f":"IF(ISNUMBER('UT 3 '!T39),'UT 3 '!T39,\"\")","v":67},{"$f":"IF('TT 1'!T39>0,'TT 1'!T39,\"\")","v":67},{"$f":"IF('UT 4'!T39>0,'UT 4'!T39,\"\")","v":67},{"$f":"IF('UT 5PB1'!T39>0,'UT 5PB1'!T39,\"\")","v":67},{"$f":"IF('PREANNU PB2 '!T39>0,'PREANNU PB2 '!T39,\"\")","v":67},{"$f":"IF(ANNUAL!T39>0,ANNUAL!T39,\"\")","v":67},6.7,6.7,6.7,6.7,{"$f":"IF(OR(ISNUMBER(BY37),ISNUMBER(BZ37),ISNUMBER(CA37),ISNUMBER(CB37),ISNUMBER(BT37),ISNUMBER(BX37)),SUM(BY37,BZ37,CA37,CB37,('TT 1'!BE38*0.3),(ANNUAL!BE38*0.3)),\"\")","v":26.8},{"$f":"IF(ISNUMBER('UT1'!W39),'UT1'!W39,\"\")","v":67},{"$f":"IF(ISNUMBER('UT 2'!W39),'UT 2'!W39,\"\")","v":67},{"$f":"IF(ISNUMBER('UT 3 '!W39),'UT 3 '!W39,\"\")","v":67},{"$f":"IF('TT 1'!W39>0,'TT 1'!W39,\"\")","v":67},{"$f":"IF('UT 4'!W39>0,'UT 4'!W39,\"\")","v":67},{"$f":"IF('UT 5PB1'!W39>0,'UT 5PB1'!W39,\"\")","v":67},{"$f":"IF('PREANNU PB2 '!W39>0,'PREANNU PB2 '!W39,\"\")","v":67},{"$f":"IF(ANNUAL!W39>0,ANNUAL!W39,\"\")","v":67},6.7,6.7,6.7,6.7,{"$f":"IF(OR(ISNUMBER(CL37),ISNUMBER(CM37),ISNUMBER(CN37),ISNUMBER(CO37),ISNUMBER(CG37),ISNUMBER(CK37)),SUM(CL37,CM37,CN37,CO37,('TT 1'!BR38*0.3),(ANNUAL!BR38*0.3)),\"\")","v":26.8},32.799999999999997,46,38.799999999999997,26.8,26.8,26.8,26.8,224.80000000000004,{"$f":"CX37/'Student Profile'!P38","v":44.960000000000008},38]
[{"$f":"ANNUAL!A40","v":""},{"$f":"ANNUAL!B40","v":""},{"$f":"IF('Student Profile'!D39>0,'Student Profile'!D39,\"\")","v":""},{"$f":"IF(ISNUMBER('UT1'!E40),'UT1'!E40,\"\")","v":92},{"$f":"IF(ISNUMBER('UT 2'!E40),'UT 2'!E40,\"\")","v":92},{"$f":"IF(ISNUMBER('UT 3 '!E40),'UT 3 '!E40,\"\")","v":92},{"$f":"IF('TT 1'!E40>0,'TT 1'!E40,\"\")","v":62},{"$f":"IF('UT 4'!E40>0,'UT 4'!E40,\"\")","v":92},{"$f":"IF('UT 5PB1'!E40>0,'UT 5PB1'!E40,\"\")","v":92},{"$f":"IF('PREANNU PB2 '!E40>0,'PREANNU PB2 '!E40,\"\")","v":92},{"$f":"IF(ANNUAL!E40>0,ANNUAL!E40,\"\")","v":55},9.1999999999999993,9.1999999999999993,9.1999999999999993,9.1999999999999993,{"$f":"IF(OR(ISNUMBER(L38),ISNUMBER(M38),ISNUMBER(N38),ISNUMBER(O38),ISNUMBER(G38),ISNUMBER(K38)),SUM(L38,M38,N38,O38,('TT 1'!D39*0.3),(ANNUAL!D39*0.3)),\"\")","v":45.8},{"$f":"IF(ISNUMBER('UT1'!H40),'UT1'!H40,\"\")","v":55},{"$f":"IF(ISNUMBER('UT 2'!H40),'UT 2'!H40,\"\")","v":92},{"$f":"IF(ISNUMBER('UT 3 '!H40),'UT 3 '!H40,\"\")","v":92},{"$f":"IF('TT 1'!H40>0,'TT 1'!H40,\"\")","v":92},{"$f":"IF('UT 4'!H40>0,'UT 4'!H40,\"\")","v":92},{"$f":"IF('UT 5PB1'!H40>0,'UT 5PB1'!H40,\"\")","v":92},{"$f":"IF('PREANNU PB2 '!H40>0,'PREANNU PB2 '!H40,\"\")","v":92},{"$f":"IF(ANNUAL!H40>0,ANNUAL!H40,\"\")","v":92},9.1999999999999993,9.1999999999999993,9.1999999999999993,9.1999999999999993,{"$f":"IF(OR(ISNUMBER(Y38),ISNUMBER(Z38),ISNUMBER(AA38),ISNUMBER(AB38),ISNUMBER(T38),ISNUMBER(X38)),SUM(Y38,Z38,AA38,AB38,('TT 1'!E39*0.3),(ANNUAL!E39*0.3)),\"\")","v":62.3},{"$f":"IF(ISNUMBER('UT1'!K40),'UT1'!K40,\"\")","v":92},{"$f":"IF(ISNUMBER('UT 2'!K40),'UT 2'!K40,\"\")","v":92},{"$f":"IF(ISNUMBER('UT 3 '!K40),'UT 3 '!K40,\"\")","v":92},{"$f":"IF('TT 1'!K40>0,'TT 1'!K40,\"\")","v":92},{"$f":"IF('UT 4'!K40>0,'UT 4'!K40,\"\")","v":92},{"$f":"IF('UT 5PB1'!K40>0,'UT 5PB1'!K40,\"\")","v":92},{"$f":"IF('PREANNU PB2 '!K40>0,'PREANNU PB2 '!K40,\"\")","v":92},{"$f":"IF(ANNUAL!K40>0,ANNUAL!K40,\"\")","v":92},9.1999999999999993,9.1999999999999993,9.1999999999999993,9.1999999999999993,{"$f":"IF(OR(ISNUMBER(AL38),ISNUMBER(AM38),ISNUMBER(AN38),ISNUMBER(AO38),ISNUMBER(AG38),ISNUMBER(AK38)),SUM(AL38,AM38,AN38,AO38,('TT 1'!R39*0.3),(ANNUAL!R39*0.3)),\"\")","v":51.8},{"$f":"IF(ISNUMBER('UT1'!N40),'UT1'!N40,\"\")","v":92},{"$f":"IF(ISNUMBER('UT 2'!N40),'UT 2'!N40,\"\")","v":92},{"$f":"IF(ISNUMBER('UT 3 '!N40),'UT 3 '!N40,\"\")","v":92},{"$f":"IF('TT 1'!N40>0,'TT 1'!N40,\"\")","v":92},{"$f":"IF('UT 4'!N40>0,'UT 4'!N40,\"\")","v":92},{"$f":"IF('UT 5PB1'!N40>0,'UT 5PB1'!N40,\"\")","v":92},{"$f":"IF('PREANNU PB2 '!N40>0,'PREANNU PB2 '!N40,\"\")","v":92},{"$f":"IF(ANNUAL!N40>0,ANNUAL!N40,\"\")","v":92},9.1999999999999993,9.1999999999999993,9.1999999999999993,9.1999999999999993,{"$f":"IF(OR(ISNUMBER(AY38),ISNUMBER(AZ38),ISNUMBER(BA38),ISNUMBER(BB38),ISNUMBER(AT38),ISNUMBER(AX38)),SUM(AY38,AZ38,BA38,BB38,('TT 1'!AE39*0.3),(ANNUAL!AE39*0.3)),\"\")","v":36.799999999999997},{"$f":"IF(ISNUMBER('UT1'!Q40),'UT1'!Q40,\"\")","v":92},{"$f":"IF(ISNUMBER('UT 2'!Q40),'UT 2'!Q40,\"\")","v":92},{"$f":"IF(ISNUMBER('UT 3 '!Q40),'UT 3 '!Q40,\"\")","v":92},{"$f":"IF('TT 1'!Q40>0,'TT 1'!Q40,\"\")","v":92},{"$f":"IF('UT 4'!Q40>0,'UT 4'!Q40,\"\")","v":92},{"$f":"IF('UT 5PB1'!Q40>0,'UT 5PB1'!Q40,\"\")","v":92},{"$f":"IF('PREANNU PB2 '!Q40>0,'PREANNU PB2 '!Q40,\"\")","v":92},{"$f":"IF(ANNUAL!Q40>0,ANNUAL!Q40,\"\")","v":92},9.1999999999999993,9.1999999999999993,9.1999999999999993,9.1999999999999993,{"$f":"IF(OR(ISNUMBER(BL38),ISNUMBER(BM38),ISNUMBER(BN38),ISNUMBER(BO38),ISNUMBER(BG38),ISNUMBER(BK38)),SUM(BL38,BM38,BN38,BO38,('TT 1'!AR39*0.3),(ANNUAL!AR39*0.3)),\"\")","v":36.799999999999997},{"$f":"IF(ISNUMBER('UT1'!T40),'UT1'!T40,\"\")","v":92},{"$f":"IF(ISNUMBER('UT 2'!T40),'UT 2'!T40,\"\")","v":92},{"$f":"IF(ISNUMBER('UT 3 '!T40),'UT 3 '!T40,\"\")","v":92},{"$f":"IF('TT 1'!T40>0,'TT 1'!T40,\"\")","v":92},{"$f":"IF('UT 4'!T40>0,'UT 4'!T40,\"\")","v":92},{"$f":"IF('UT 5PB1'!T40>0,'UT 5PB1'!T40,\"\")","v":92},{"$f":"IF('PREANNU PB2 '!T40>0,'PREANNU PB2 '!T40,\"\")","v":92},{"$f":"IF(ANNUAL!T40>0,ANNUAL!T40,\"\")","v":92},9.1999999999999993,9.1999999999999993,9.1999999999999993,9.1999999999999993,{"$f":"IF(OR(ISNUMBER(BY38),ISNUMBER(BZ38),ISNUMBER(CA38),ISNUMBER(CB38),ISNUMBER(BT38),ISNUMBER(BX38)),SUM(BY38,BZ38,CA38,CB38,('TT 1'!BE39*0.3),(ANNUAL!BE39*0.3)),\"\")","v":36.799999999999997},{"$f":"IF(ISNUMBER('UT1'!W40),'UT1'!W40,\"\")","v":92},{"$f":"IF(ISNUMBER('UT 2'!W40),'UT 2'!W40,\"\")","v":92},{"$f":"IF(ISNUMBER('UT 3 '!W40),'UT 3 '!W40,\"\")","v":92},{"$f":"IF('TT 1'!W40>0,'TT 1'!W40,\"\")","v":92},{"$f":"IF('UT 4'!W40>0,'UT 4'!W40,\"\")","v":92},{"$f":"IF('UT 5PB1'!W40>0,'UT 5PB1'!W40,\"\")","v":92},{"$f":"IF('PREANNU PB2 '!W40>0,'PREANNU PB2 '!W40,\"\")","v":92},{"$f":"IF(ANNUAL!W40>0,ANNUAL!W40,\"\")","v":92},9.1999999999999993,9.1999999999999993,9.1999999999999993,9.1999999999999993,{"$f":"IF(OR(ISNUMBER(CL38),ISNUMBER(CM38),ISNUMBER(CN38),ISNUMBER(CO38),ISNUMBER(CG38),ISNUMBER(CK38)),SUM(CL38,CM38,CN38,CO38,('TT 1'!BR39*0.3),(ANNUAL!BR39*0.3)),\"\")","v":36.799999999999997},45.8,62.3,51.8,36.799999999999997,36.799999999999997,36.799999999999997,36.799999999999997,307.10000000000002,{"$f":"CX38/'Student Profile'!P39","v":61.42},1]
[{"$f":"ANNUAL!A41","v":""},{"$f":"ANNUAL!B41","v":""},{"$f":"IF('Student Profile'!D40>0,'Student Profile'!D40,\"\")","v":""},{"$f":"IF(ISNUMBER('UT1'!E41),'UT1'!E41,\"\")","v":70},{"$f":"IF(ISNUMBER('UT 2'!E41),'UT 2'!E41,\"\")","v":70},{"$f":"IF(ISNUMBER('UT 3 '!E41),'UT 3 '!E41,\"\")","v":70},{"$f":"IF('TT 1'!E41>0,'TT 1'!E41,\"\")","v":47},{"$f":"IF('UT 4'!E41>0,'UT 4'!E41,\"\")","v":70},{"$f":"IF('UT 5PB1'!E41>0,'UT 5PB1'!E41,\"\")","v":70},{"$f":"IF('PREANNU PB2 '!E41>0,'PREANNU PB2 '!E41,\"\")","v":70},{"$f":"IF(ANNUAL!E41>0,ANNUAL!E41,\"\")","v":42},7,7,7,7,{"$f":"IF(OR(ISNUMBER(L39),ISNUMBER(M39),ISNUMBER(N39),ISNUMBER(O39),ISNUMBER(G39),ISNUMBER(K39)),SUM(L39,M39,N39,O39,('TT 1'!D40*0.3),(ANNUAL!D40*0.3)),\"\")","v":40},{"$f":"IF(ISNUMBER('UT1'!H41),'UT1'!H41,\"\")","v":42},{"$f":"IF(ISNUMBER('UT 2'!H41),'UT 2'!H41,\"\")","v":70},{"$f":"IF(ISNUMBER('UT 3 '!H41),'UT 3 '!H41,\"\")","v":70},{"$f":"IF('TT 1'!H41>0,'TT 1'!H41,\"\")","v":70},{"$f":"IF('UT 4'!H41>0,'UT 4'!H41,\"\")","v":70},{"$f":"IF('UT 5PB1'!H41>0,'UT 5PB1'!H41,\"\")","v":70},{"$f":"IF('PREANNU PB2 '!H41>0,'PREANNU PB2 '!H41,\"\")","v":70},{"$f":"IF(ANNUAL!H41>0,ANNUAL!H41,\"\")","v":70},7,7,7,7,{"$f":"IF(OR(ISNUMBER(Y39),ISNUMBER(Z39),ISNUMBER(AA39),ISNUMBER(AB39),ISNUMBER(T39),ISNUMBER(X39)),SUM(Y39,Z39,AA39,AB39,('TT 1'!E40*0.3),(ANNUAL!E40*0.3)),\"\")","v":63.099999999999994},{"$f":"IF(ISNUMBER('UT1'!K41),'UT1'!K41,\"\")","v":70},{"$f":"IF(ISNUMBER('UT 2'!K41),'UT 2'!K41,\"\")","v":70},{"$f":"IF(ISNUMBER('UT 3 '!K41),'UT 3 '!K41,\"\")","v":70},{"$f":"IF('TT 1'!K41>0,'TT 1'!K41,\"\")","v":70},{"$f":"IF('UT 4'!K41>0,'UT 4'!K41,\"\")","v":70},{"$f":"IF('UT 5PB1'!K41>0,'UT 5PB1'!K41,\"\")","v":70},{"$f":"IF('PREANNU PB2 '!K41>0,'PREANNU PB2 '!K41,\"\")","v":70},{"$f":"IF(ANNUAL!K41>0,ANNUAL!K41,\"\")","v":70},7,7,7,7,{"$f":"IF(OR(ISNUMBER(AL39),ISNUMBER(AM39),ISNUMBER(AN39),ISNUMBER(AO39),ISNUMBER(AG39),ISNUMBER(AK39)),SUM(AL39,AM39,AN39,AO39,('TT 1'!R40*0.3),(ANNUAL!R40*0.3)),\"\")","v":49},{"$f":"IF(ISNUMBER('UT1'!N41),'UT1'!N41,\"\")","v":70},{"$f":"IF(ISNUMBER('UT 2'!N41),'UT 2'!N41,\"\")","v":70},{"$f":"IF(ISNUMBER('UT 3 '!N41),'UT 3 '!N41,\"\")","v":70},{"$f":"IF('TT 1'!N41>0,'TT 1'!N41,\"\")","v":70},{"$f":"IF('UT 4'!N41>0,'UT 4'!N41,\"\")","v":70},{"$f":"IF('UT 5PB1'!N41>0,'UT 5PB1'!N41,\"\")","v":70},{"$f":"IF('PREANNU PB2 '!N41>0,'PREANNU PB2 '!N41,\"\")","v":70},{"$f":"IF(ANNUAL!N41>0,ANNUAL!N41,\"\")","v":70},7,7,7,7,{"$f":"IF(OR(ISNUMBER(AY39),ISNUMBER(AZ39),ISNUMBER(BA39),ISNUMBER(BB39),ISNUMBER(AT39),ISNUMBER(AX39)),SUM(AY39,AZ39,BA39,BB39,('TT 1'!AE40*0.3),(ANNUAL!AE40*0.3)),\"\")","v":28},{"$f":"IF(ISNUMBER('UT1'!Q41),'UT1'!Q41,\"\")","v":70},{"$f":"IF(ISNUMBER('UT 2'!Q41),'UT 2'!Q41,\"\")","v":70},{"$f":"IF(ISNUMBER('UT 3 '!Q41),'UT 3 '!Q41,\"\")","v":70},{"$f":"IF('TT 1'!Q41>0,'TT 1'!Q41,\"\")","v":70},{"$f":"IF('UT 4'!Q41>0,'UT 4'!Q41,\"\")","v":70},{"$f":"IF('UT 5PB1'!Q41>0,'UT 5PB1'!Q41,\"\")","v":70},{"$f":"IF('PREANNU PB2 '!Q41>0,'PREANNU PB2 '!Q41,\"\")","v":70},{"$f":"IF(ANNUAL!Q41>0,ANNUAL!Q41,\"\")","v":70},7,7,7,7,{"$f":"IF(OR(ISNUMBER(BL39),ISNUMBER(BM39),ISNUMBER(BN39),ISNUMBER(BO39),ISNUMBER(BG39),ISNUMBER(BK39)),SUM(BL39,BM39,BN39,BO39,('TT 1'!AR40*0.3),(ANNUAL!AR40*0.3)),\"\")","v":28},{"$f":"IF(ISNUMBER('UT1'!T41),'UT1'!T41,\"\")","v":70},{"$f":"IF(ISNUMBER('UT 2'!T41),'UT 2'!T41,\"\")","v":70},{"$f":"IF(ISNUMBER('UT 3 '!T41),'UT 3 '!T41,\"\")","v":70},{"$f":"IF('TT 1'!T41>0,'TT 1'!T41,\"\")","v":70},{"$f":"IF('UT 4'!T41>0,'UT 4'!T41,\"\")","v":70},{"$f":"IF('UT 5PB1'!T41>0,'UT 5PB1'!T41,\"\")","v":70},{"$f":"IF('PREANNU PB2 '!T41>0,'PREANNU PB2 '!T41,\"\")","v":70},{"$f":"IF(ANNUAL!T41>0,ANNUAL!T41,\"\")","v":70},7,7,7,7,{"$f":"IF(OR(ISNUMBER(BY39),ISNUMBER(BZ39),ISNUMBER(CA39),ISNUMBER(CB39),ISNUMBER(BT39),ISNUMBER(BX39)),SUM(BY39,BZ39,CA39,CB39,('TT 1'!BE40*0.3),(ANNUAL!BE40*0.3)),\"\")","v":28},{"$f":"IF(ISNUMBER('UT1'!W41),'UT1'!W41,\"\")","v":70},{"$f":"IF(ISNUMBER('UT 2'!W41),'UT 2'!W41,\"\")","v":70},{"$f":"IF(ISNUMBER('UT 3 '!W41),'UT 3 '!W41,\"\")","v":70},{"$f":"IF('TT 1'!W41>0,'TT 1'!W41,\"\")","v":70},{"$f":"IF('UT 4'!W41>0,'UT 4'!W41,\"\")","v":70},{"$f":"IF('UT 5PB1'!W41>0,'UT 5PB1'!W41,\"\")","v":70},{"$f":"IF('PREANNU PB2 '!W41>0,'PREANNU PB2 '!W41,\"\")","v":70},{"$f":"IF(ANNUAL!W41>0,ANNUAL!W41,\"\")","v":70},7,7,7,7,{"$f":"IF(OR(ISNUMBER(CL39),ISNUMBER(CM39),ISNUMBER(CN39),ISNUMBER(CO39),ISNUMBER(CG39),ISNUMBER(CK39)),SUM(CL39,CM39,CN39,CO39,('TT 1'!BR40*0.3),(ANNUAL!BR40*0.3)),\"\")","v":28},40,63.099999999999994,49,28,28,28,28,264.10000000000002,{"$f":"CX39/'Student Profile'!P40","v":52.820000000000007},28]
[{"$f":"ANNUAL!A42","v":""},{"$f":"ANNUAL!B42","v":""},{"$f":"IF('Student Profile'!D41>0,'Student Profile'!D41,\"\")","v":""},{"$f":"IF(ISNUMBER('UT1'!E42),'UT1'!E42,\"\")","v":82},{"$f":"IF(ISNUMBER('UT 2'!E42),'UT 2'!E42,\"\")","v":82},{"$f":"IF(ISNUMBER('UT 3 '!E42),'UT 3 '!E42,\"\")","v":82},{"$f":"IF('TT 1'!E42>0,'TT 1'!E42,\"\")","v":55},{"$f":"IF('UT 4'!E42>0,'UT 4'!E42,\"\")","v":82},{"$f":"IF('UT 5PB1'!E42>0,'UT 5PB1'!E42,\"\")","v":82},{"$f":"IF('PREANNU PB2 '!E42>0,'PREANNU PB2 '!E42,\"\")","v":82},{"$f":"IF(ANNUAL!E42>0,ANNUAL!E42,\"\")","v":49},8.1999999999999993,8.1999999999999993,8.1999999999999993,8.1999999999999993,{"$f":"IF(OR(ISNUMBER(L40),ISNUMBER(M40),ISNUMBER(N40),ISNUMBER(O40),ISNUMBER(G40),ISNUMBER(K40)),SUM(L40,M40,N40,O40,('TT 1'!D41*0.3),(ANNUAL!D41*0.3)),\"\")","v":43},{"$f":"IF(ISNUMBER('UT1'!H42),'UT1'!H42,\"\")","v":49},{"$f":"IF(ISNUMBER('UT 2'!H42),'UT 2'!H42,\"\")","v":82},{"$f":"IF(ISNUMBER('UT 3 '!H42),'UT 3 '!H42,\"\")","v":82},{"$f":"IF('TT 1'!H42>0,'TT 1'!H42,\"\")","v":82},{"$f":"IF('UT 4'!H42>0,'UT 4'!H42,\"\")","v":82},{"$f":"IF('UT 5PB1'!H42>0,'UT 5PB1'!H42,\"\")","v":82},{"$f":"IF('PREANNU PB2 '!H42>0,'PREANNU PB2 '!H42,\"\")","v":82},{"$f":"IF(ANNUAL!H42>0,ANNUAL!H42,\"\")","v":82},8.1999999999999993,8.1999999999999993,8.1999999999999993,8.1999999999999993,{"$f":"IF(OR(ISNUMBER(Y40),ISNUMBER(Z40),ISNUMBER(AA40),ISNUMBER(AB40),ISNUMBER(T40),ISNUMBER(X40)),SUM(Y40,Z40,AA40,AB40,('TT 1'!E41*0.3),(ANNUAL!E41*0.3)),\"\")","v":59.5},{"$f":"IF(ISNUMBER('UT1'!K42),'UT1'!K42,\"\")","v":82},{"$f":"IF(ISNUMBER('UT 2'!K42),'UT 2'!K42,\"\")","v":82},{"$f":"IF(ISNUMBER('UT 3 '!K42),'UT 3 '!K42,\"\")","v":82},{"$f":"IF('TT 1'!K42>0,'TT 1'!K42,\"\")","v":82},{"$f":"IF('UT 4'!K42>0,'UT 4'!K42,\"\")","v":82},{"$f":"IF('UT 5PB1'!K42>0,'UT 5PB1'!K42,\"\")","v":82},{"$f":"IF('PREANNU PB2 '!K42>0,'PREANNU PB2 '!K42,\"\")","v":82},{"$f":"IF(ANNUAL!K42>0,ANNUAL!K42,\"\")","v":82},8.1999999999999993,8.1999999999999993,8.1999999999999993,8.1999999999999993,{"$f":"IF(OR(ISNUMBER(AL40),ISNUMBER(AM40),ISNUMBER(AN40),ISNUMBER(AO40),ISNUMBER(AG40),ISNUMBER(AK40)),SUM(AL40,AM40,AN40,AO40,('TT 1'!R41*0.3),(ANNUAL!R41*0.3)),\"\")","v":47.8},{"$f":"IF(ISNUMBER('UT1'!N42),'UT1'!N42,\"\")","v":82},{"$f":"IF(ISNUMBER('UT 2'!N42),'UT 2'!N42,\"\")","v":82},{"$f":"IF(ISNUMBER('UT 3 '!N42),'UT 3 '!N42,\"\")","v":82},{"$f":"IF('TT 1'!N42>0,'TT 1'!N42,\"\")","v":82},{"$f":"IF('UT 4'!N42>0,'UT 4'!N42,\"\")","v":82},{"$f":"IF('UT 5PB1'!N42>0,'UT 5PB1'!N42,\"\")","v":82},{"$f":"IF('PREANNU PB2 '!N42>0,'PREANNU PB2 '!N42,\"\")","v":82},{"$f":"IF(ANNUAL!N42>0,ANNUAL!N42,\"\")","v":82},8.1999999999999993,8.1999999999999993,8.1999999999999993,8.1999999999999993,{"$f":"IF(OR(ISNUMBER(AY40),ISNUMBER(AZ40),ISNUMBER(BA40),ISNUMBER(BB40),ISNUMBER(AT40),ISNUMBER(AX40)),SUM(AY40,AZ40,BA40,BB40,('TT 1'!AE41*0.3),(ANNUAL!AE41*0.3)),\"\")","v":32.799999999999997},{"$f":"IF(ISNUMBER('UT1'!Q42),'UT1'!Q42,\"\")","v":82},{"$f":"IF(ISNUMBER('UT 2'!Q42),'UT 2'!Q42,\"\")","v":82},{"$f":"IF(ISNUMBER('UT 3 '!Q42),'UT 3 '!Q42,\"\")","v":82},{"$f":"IF('TT 1'!Q42>0,'TT 1'!Q42,\"\")","v":82},{"$f":"IF('UT 4'!Q42>0,'UT 4'!Q42,\"\")","v":82},{"$f":"IF('UT 5PB1'!Q42>0,'UT 5PB1'!Q42,\"\")","v":82},{"$f":"IF('PREANNU PB2 '!Q42>0,'PREANNU PB2 '!Q42,\"\")","v":82},{"$f":"IF(ANNUAL!Q42>0,ANNUAL!Q42,\"\")","v":82},8.1999999999999993,8.1999999999999993,8.1999999999999993,8.1999999999999993,{"$f":"IF(OR(ISNUMBER(BL40),ISNUMBER(BM40),ISNUMBER(BN40),ISNUMBER(BO40),ISNUMBER(BG40),ISNUMBER(BK40)),SUM(BL40,BM40,BN40,BO40,('TT 1'!AR41*0.3),(ANNUAL!AR41*0.3)),\"\")","v":32.799999999999997},{"$f":"IF(ISNUMBER('UT1'!T42),'UT1'!T42,\"\")","v":82},{"$f":"IF(ISNUMBER('UT 2'!T42),'UT 2'!T42,\"\")","v":82},{"$f":"IF(ISNUMBER('UT 3 '!T42),'UT 3 '!T42,\"\")","v":82},{"$f":"IF('TT 1'!T42>0,'TT 1'!T42,\"\")","v":82},{"$f":"IF('UT 4'!T42>0,'UT 4'!T42,\"\")","v":82},{"$f":"IF('UT 5PB1'!T42>0,'UT 5PB1'!T42,\"\")","v":82},{"$f":"IF('PREANNU PB2 '!T42>0,'PREANNU PB2 '!T42,\"\")","v":82},{"$f":"IF(ANNUAL!T42>0,ANNUAL!T42,\"\")","v":82},8.1999999999999993,8.1999999999999993,8.1999999999999993,8.1999999999999993,{"$f":"IF(OR(ISNUMBER(BY40),ISNUMBER(BZ40),ISNUMBER(CA40),ISNUMBER(CB40),ISNUMBER(BT40),ISNUMBER(BX40)),SUM(BY40,BZ40,CA40,CB40,('TT 1'!BE41*0.3),(ANNUAL!BE41*0.3)),\"\")","v":32.799999999999997},{"$f":"IF(ISNUMBER('UT1'!W42),'UT1'!W42,\"\")","v":82},{"$f":"IF(ISNUMBER('UT 2'!W42),'UT 2'!W42,\"\")","v":82},{"$f":"IF(ISNUMBER('UT 3 '!W42),'UT 3 '!W42,\"\")","v":82},{"$f":"IF('TT 1'!W42>0,'TT 1'!W42,\"\")","v":82},{"$f":"IF('UT 4'!W42>0,'UT 4'!W42,\"\")","v":82},{"$f":"IF('UT 5PB1'!W42>0,'UT 5PB1'!W42,\"\")","v":82},{"$f":"IF('PREANNU PB2 '!W42>0,'PREANNU PB2 '!W42,\"\")","v":82},{"$f":"IF(ANNUAL!W42>0,ANNUAL!W42,\"\")","v":82},8.1999999999999993,8.1999999999999993,8.1999999999999993,8.1999999999999993,{"$f":"IF(OR(ISNUMBER(CL40),ISNUMBER(CM40),ISNUMBER(CN40),ISNUMBER(CO40),ISNUMBER(CG40),ISNUMBER(CK40)),SUM(CL40,CM40,CN40,CO40,('TT 1'!BR41*0.3),(ANNUAL!BR41*0.3)),\"\")","v":32.799999999999997},43,59.5,47.8,32.799999999999997,32.799999999999997,32.799999999999997,32.799999999999997,281.50000000000006,{"$f":"CX40/'Student Profile'!P41","v":56.300000000000011},10]
[{"$f":"ANNUAL!A43","v":""},{"$f":"ANNUAL!B43","v":""},{"$f":"IF('Student Profile'!D42>0,'Student Profile'!D42,\"\")","v":""},{"$f":"IF(ISNUMBER('UT1'!E43),'UT1'!E43,\"\")","v":85},{"$f":"IF(ISNUMBER('UT 2'!E43),'UT 2'!E43,\"\")","v":85},{"$f":"IF(ISNUMBER('UT 3 '!E43),'UT 3 '!E43,\"\")","v":85},{"$f":"IF('TT 1'!E43>0,'TT 1'!E43,\"\")","v":57},{"$f":"IF('UT 4'!E43>0,'UT 4'!E43,\"\")","v":85},{"$f":"IF('UT 5PB1'!E43>0,'UT 5PB1'!E43,\"\")","v":85},{"$f":"IF('PREANNU PB2 '!E43>0,'PREANNU PB2 '!E43,\"\")","v":85},{"$f":"IF(ANNUAL!E43>0,ANNUAL!E43,\"\")","v":51},8.5,8.5,8.5,8.5,{"$f":"IF(OR(ISNUMBER(L41),ISNUMBER(M41),ISNUMBER(N41),ISNUMBER(O41),ISNUMBER(G41),ISNUMBER(K41)),SUM(L41,M41,N41,O41,('TT 1'!D42*0.3),(ANNUAL!D42*0.3)),\"\")","v":43},{"$f":"IF(ISNUMBER('UT1'!H43),'UT1'!H43,\"\")","v":51},{"$f":"IF(ISNUMBER('UT 2'!H43),'UT 2'!H43,\"\")","v":85},{"$f":"IF(ISNUMBER('UT 3 '!H43),'UT 3 '!H43,\"\")","v":85},{"$f":"IF('TT 1'!H43>0,'TT 1'!H43,\"\")","v":85},{"$f":"IF('UT 4'!H43>0,'UT 4'!H43,\"\")","v":85},{"$f":"IF('UT 5PB1'!H43>0,'UT 5PB1'!H43,\"\")","v":85},{"$f":"IF('PREANNU PB2 '!H43>0,'PREANNU PB2 '!H43,\"\")","v":85},{"$f":"IF(ANNUAL!H43>0,ANNUAL!H43,\"\")","v":85},8.5,8.5,8.5,8.5,{"$f":"IF(OR(ISNUMBER(Y41),ISNUMBER(Z41),ISNUMBER(AA41),ISNUMBER(AB41),ISNUMBER(T41),ISNUMBER(X41)),SUM(Y41,Z41,AA41,AB41,('TT 1'!E42*0.3),(ANNUAL!E42*0.3)),\"\")","v":65.2},{"$f":"IF(ISNUMBER('UT1'!K43),'UT1'!K43,\"\")","v":85},{"$f":"IF(ISNUMBER('UT 2'!K43),'UT 2'!K43,\"\")","v":85},{"$f":"IF(ISNUMBER('UT 3 '!K43),'UT 3 '!K43,\"\")","v":85},{"$f":"IF('TT 1'!K43>0,'TT 1'!K43,\"\")","v":85},{"$f":"IF('UT 4'!K43>0,'UT 4'!K43,\"\")","v":85},{"$f":"IF('UT 5PB1'!K43>0,'UT 5PB1'!K43,\"\")","v":85},{"$f":"IF('PREANNU PB2 '!K43>0,'PREANNU PB2 '!K43,\"\")","v":85},{"$f":"IF(ANNUAL!K43>0,ANNUAL!K43,\"\")","v":85},8.5,8.5,8.5,8.5,{"$f":"IF(OR(ISNUMBER(AL41),ISNUMBER(AM41),ISNUMBER(AN41),ISNUMBER(AO41),ISNUMBER(AG41),ISNUMBER(AK41)),SUM(AL41,AM41,AN41,AO41,('TT 1'!R42*0.3),(ANNUAL!R42*0.3)),\"\")","v":54.400000000000006},{"$f":"IF(ISNUMBER('UT1'!N43),'UT1'!N43,\"\")","v":85},{"$f":"IF(ISNUMBER('UT 2'!N43),'UT 2'!N43,\"\")","v":85},{"$f":"IF(ISNUMBER('UT 3 '!N43),'UT 3 '!N43,\"\")","v":85},{"$f":"IF('TT 1'!N43>0,'TT 1'!N43,\"\")","v":85},{"$f":"IF('UT 4'!N43>0,'UT 4'!N43,\"\")","v":85},{"$f":"IF('UT 5PB1'!N43>0,'UT 5PB1'!N43,\"\")","v":85},{"$f":"IF('PREANNU PB2 '!N43>0,'PREANNU PB2 '!N43,\"\")","v":85},{"$f":"IF(ANNUAL!N43>0,ANNUAL!N43,\"\")","v":85},8.5,8.5,8.5,8.5,{"$f":"IF(OR(ISNUMBER(AY41),ISNUMBER(AZ41),ISNUMBER(BA41),ISNUMBER(BB41),ISNUMBER(AT41),ISNUMBER(AX41)),SUM(AY41,AZ41,BA41,BB41,('TT 1'!AE42*0.3),(ANNUAL!AE42*0.3)),\"\")","v":34},{"$f":"IF(ISNUMBER('UT1'!Q43),'UT1'!Q43,\"\")","v":85},{"$f":"IF(ISNUMBER('UT 2'!Q43),'UT 2'!Q43,\"\")","v":85},{"$f":"IF(ISNUMBER('UT 3 '!Q43),'UT 3 '!Q43,\"\")","v":85},{"$f":"IF('TT 1'!Q43>0,'TT 1'!Q43,\"\")","v":85},{"$f":"IF('UT 4'!Q43>0,'UT 4'!Q43,\"\")","v":85},{"$f":"IF('UT 5PB1'!Q43>0,'UT 5PB1'!Q43,\"\")","v":85},{"$f":"IF('PREANNU PB2 '!Q43>0,'PREANNU PB2 '!Q43,\"\")","v":85},{"$f":"IF(ANNUAL!Q43>0,ANNUAL!Q43,\"\")","v":85},8.5,8.5,8.5,8.5,{"$f":"IF(OR(ISNUMBER(BL41),ISNUMBER(BM41),ISNUMBER(BN41),ISNUMBER(BO41),ISNUMBER(BG41),ISNUMBER(BK41)),SUM(BL41,BM41,BN41,BO41,('TT 1'!AR42*0.3),(ANNUAL!AR42*0.3)),\"\")","v":34},{"$f":"IF(ISNUMBER('UT1'!T43),'UT1'!T43,\"\")","v":85},{"$f":"IF(ISNUMBER('UT 2'!T43),'UT 2'!T43,\"\")","v":85},{"$f":"IF(ISNUMBER('UT 3 '!T43),'UT 3 '!T43,\"\")","v":85},{"$f":"IF('TT 1'!T43>0,'TT 1'!T43,\"\")","v":85},{"$f":"IF('UT 4'!T43>0,'UT 4'!T43,\"\")","v":85},{"$f":"IF('UT 5PB1'!T43>0,'UT 5PB1'!T43,\"\")","v":85},{"$f":"IF('PREANNU PB2 '!T43>0,'PREANNU PB2 '!T43,\"\")","v":85},{"$f":"IF(ANNUAL!T43>0,ANNUAL!T43,\"\")","v":85},8.5,8.5,8.5,8.5,{"$f":"IF(OR(ISNUMBER(BY41),ISNUMBER(BZ41),ISNUMBER(CA41),ISNUMBER(CB41),ISNUMBER(BT41),ISNUMBER(BX41)),SUM(BY41,BZ41,CA41,CB41,('TT 1'!BE42*0.3),(ANNUAL!BE42*0.3)),\"\")","v":34},{"$f":"IF(ISNUMBER('UT1'!W43),'UT1'!W43,\"\")","v":85},{"$f":"IF(ISNUMBER('UT 2'!W43),'UT 2'!W43,\"\")","v":85},{"$f":"IF(ISNUMBER('UT 3 '!W43),'UT 3 '!W43,\"\")","v":85},{"$f":"IF('TT 1'!W43>0,'TT 1'!W43,\"\")","v":85},{"$f":"IF('UT 4'!W43>0,'UT 4'!W43,\"\")","v":85},{"$f":"IF('UT 5PB1'!W43>0,'UT 5PB1'!W43,\"\")","v":85},{"$f":"IF('PREANNU PB2 '!W43>0,'PREANNU PB2 '!W43,\"\")","v":85},{"$f":"IF(ANNUAL!W43>0,ANNUAL!W43,\"\")","v":85},8.5,8.5,8.5,8.5,{"$f":"IF(OR(ISNUMBER(CL41),ISNUMBER(CM41),ISNUMBER(CN41),ISNUMBER(CO41),ISNUMBER(CG41),ISNUMBER(CK41)),SUM(CL41,CM41,CN41,CO41,('TT 1'!BR42*0.3),(ANNUAL!BR42*0.3)),\"\")","v":34},43,65.2,54.400000000000006,34,34,34,34,298.60000000000002,{"$f":"CX41/'Student Profile'!P42","v":59.720000000000006},5]
[{"$f":"ANNUAL!A44","v":""},{"$f":"ANNUAL!B44","v":""},{"$f":"IF('Student Profile'!D43>0,'Student Profile'!D43,\"\")","v":""},{"$f":"IF(ISNUMBER('UT1'!E44),'UT1'!E44,\"\")","v":67},{"$f":"IF(ISNUMBER('UT 2'!E44),'UT 2'!E44,\"\")","v":67},{"$f":"IF(ISNUMBER('UT 3 '!E44),'UT 3 '!E44,\"\")","v":67},{"$f":"IF('TT 1'!E44>0,'TT 1'!E44,\"\")","v":45},{"$f":"IF('UT 4'!E44>0,'UT 4'!E44,\"\")","v":67},{"$f":"IF('UT 5PB1'!E44>0,'UT 5PB1'!E44,\"\")","v":67},{"$f":"IF('PREANNU PB2 '!E44>0,'PREANNU PB2 '!E44,\"\")","v":67},{"$f":"IF(ANNUAL!E44>0,ANNUAL!E44,\"\")","v":40},6.7,6.7,6.7,6.7,{"$f":"IF(OR(ISNUMBER(L42),ISNUMBER(M42),ISNUMBER(N42),ISNUMBER(O42),ISNUMBER(G42),ISNUMBER(K42)),SUM(L42,M42,N42,O42,('TT 1'!D43*0.3),(ANNUAL!D43*0.3)),\"\")","v":35.799999999999997},{"$f":"IF(ISNUMBER('UT1'!H44),'UT1'!H44,\"\")","v":40},{"$f":"IF(ISNUMBER('UT 2'!H44),'UT 2'!H44,\"\")","v":67},{"$f":"IF(ISNUMBER('UT 3 '!H44),'UT 3 '!H44,\"\")","v":67},{"$f":"IF('TT 1'!H44>0,'TT 1'!H44,\"\")","v":67},{"$f":"IF('UT 4'!H44>0,'UT 4'!H44,\"\")","v":67},{"$f":"IF('UT 5PB1'!H44>0,'UT 5PB1'!H44,\"\")","v":67},{"$f":"IF('PREANNU PB2 '!H44>0,'PREANNU PB2 '!H44,\"\")","v":67},{"$f":"IF(ANNUAL!H44>0,ANNUAL!H44,\"\")","v":67},6.7,6.7,6.7,6.7,{"$f":"IF(OR(ISNUMBER(Y42),ISNUMBER(Z42),ISNUMBER(AA42),ISNUMBER(AB42),ISNUMBER(T42),ISNUMBER(X42)),SUM(Y42,Z42,AA42,AB42,('TT 1'!E43*0.3),(ANNUAL!E43*0.3)),\"\")","v":59.199999999999996},{"$f":"IF(ISNUMBER('UT1'!K44),'UT1'!K44,\"\")","v":67},{"$f":"IF(ISNUMBER('UT 2'!K44),'UT 2'!K44,\"\")","v":67},{"$f":"IF(ISNUMBER('UT 3 '!K44),'UT 3 '!K44,\"\")","v":67},{"$f":"IF('TT 1'!K44>0,'TT 1'!K44,\"\")","v":67},{"$f":"IF('UT 4'!K44>0,'UT 4'!K44,\"\")","v":67},{"$f":"IF('UT 5PB1'!K44>0,'UT 5PB1'!K44,\"\")","v":67},{"$f":"IF('PREANNU PB2 '!K44>0,'PREANNU PB2 '!K44,\"\")","v":67},{"$f":"IF(ANNUAL!K44>0,ANNUAL!K44,\"\")","v":67},6.7,6.7,6.7,6.7,{"$f":"IF(OR(ISNUMBER(AL42),ISNUMBER(AM42),ISNUMBER(AN42),ISNUMBER(AO42),ISNUMBER(AG42),ISNUMBER(AK42)),SUM(AL42,AM42,AN42,AO42,('TT 1'!R43*0.3),(ANNUAL!R43*0.3)),\"\")","v":48.4},{"$f":"IF(ISNUMBER('UT1'!N44),'UT1'!N44,\"\")","v":67},{"$f":"IF(ISNUMBER('UT 2'!N44),'UT 2'!N44,\"\")","v":67},{"$f":"IF(ISNUMBER('UT 3 '!N44),'UT 3 '!N44,\"\")","v":67},{"$f":"IF('TT 1'!N44>0,'TT 1'!N44,\"\")","v":67},{"$f":"IF('UT 4'!N44>0,'UT 4'!N44,\"\")","v":67},{"$f":"IF('UT 5PB1'!N44>0,'UT 5PB1'!N44,\"\")","v":67},{"$f":"IF('PREANNU PB2 '!N44>0,'PREANNU PB2 '!N44,\"\")","v":67},{"$f":"IF(ANNUAL!N44>0,ANNUAL!N44,\"\")","v":67},6.7,6.7,6.7,6.7,{"$f":"IF(OR(ISNUMBER(AY42),ISNUMBER(AZ42),ISNUMBER(BA42),ISNUMBER(BB42),ISNUMBER(AT42),ISNUMBER(AX42)),SUM(AY42,AZ42,BA42,BB42,('TT 1'!AE43*0.3),(ANNUAL!AE43*0.3)),\"\")","v":26.8},{"$f":"IF(ISNUMBER('UT1'!Q44),'UT1'!Q44,\"\")","v":67},{"$f":"IF(ISNUMBER('UT 2'!Q44),'UT 2'!Q44,\"\")","v":67},{"$f":"IF(ISNUMBER('UT 3 '!Q44),'UT 3 '!Q44,\"\")","v":67},{"$f":"IF('TT 1'!Q44>0,'TT 1'!Q44,\"\")","v":67},{"$f":"IF('UT 4'!Q44>0,'UT 4'!Q44,\"\")","v":67},{"$f":"IF('UT 5PB1'!Q44>0,'UT 5PB1'!Q44,\"\")","v":67},{"$f":"IF('PREANNU PB2 '!Q44>0,'PREANNU PB2 '!Q44,\"\")","v":67},{"$f":"IF(ANNUAL!Q44>0,ANNUAL!Q44,\"\")","v":67},6.7,6.7,6.7,6.7,{"$f":"IF(OR(ISNUMBER(BL42),ISNUMBER(BM42),ISNUMBER(BN42),ISNUMBER(BO42),ISNUMBER(BG42),ISNUMBER(BK42)),SUM(BL42,BM42,BN42,BO42,('TT 1'!AR43*0.3),(ANNUAL!AR43*0.3)),\"\")","v":26.8},{"$f":"IF(ISNUMBER('UT1'!T44),'UT1'!T44,\"\")","v":67},{"$f":"IF(ISNUMBER('UT 2'!T44),'UT 2'!T44,\"\")","v":67},{"$f":"IF(ISNUMBER('UT 3 '!T44),'UT 3 '!T44,\"\")","v":67},{"$f":"IF('TT 1'!T44>0,'TT 1'!T44,\"\")","v":67},{"$f":"IF('UT 4'!T44>0,'UT 4'!T44,\"\")","v":67},{"$f":"IF('UT 5PB1'!T44>0,'UT 5PB1'!T44,\"\")","v":67},{"$f":"IF('PREANNU PB2 '!T44>0,'PREANNU PB2 '!T44,\"\")","v":67},{"$f":"IF(ANNUAL!T44>0,ANNUAL!T44,\"\")","v":67},6.7,6.7,6.7,6.7,{"$f":"IF(OR(ISNUMBER(BY42),ISNUMBER(BZ42),ISNUMBER(CA42),ISNUMBER(CB42),ISNUMBER(BT42),ISNUMBER(BX42)),SUM(BY42,BZ42,CA42,CB42,('TT 1'!BE43*0.3),(ANNUAL!BE43*0.3)),\"\")","v":26.8},{"$f":"IF(ISNUMBER('UT1'!W44),'UT1'!W44,\"\")","v":67},{"$f":"IF(ISNUMBER('UT 2'!W44),'UT 2'!W44,\"\")","v":67},{"$f":"IF(ISNUMBER('UT 3 '!W44),'UT 3 '!W44,\"\")","v":67},{"$f":"IF('TT 1'!W44>0,'TT 1'!W44,\"\")","v":67},{"$f":"IF('UT 4'!W44>0,'UT 4'!W44,\"\")","v":67},{"$f":"IF('UT 5PB1'!W44>0,'UT 5PB1'!W44,\"\")","v":67},{"$f":"IF('PREANNU PB2 '!W44>0,'PREANNU PB2 '!W44,\"\")","v":67},{"$f":"IF(ANNUAL!W44>0,ANNUAL!W44,\"\")","v":67},6.7,6.7,6.7,6.7,{"$f":"IF(OR(ISNUMBER(CL42),ISNUMBER(CM42),ISNUMBER(CN42),ISNUMBER(CO42),ISNUMBER(CG42),ISNUMBER(CK42)),SUM(CL42,CM42,CN42,CO42,('TT 1'!BR43*0.3),(ANNUAL!BR43*0.3)),\"\")","v":26.8},35.799999999999997,59.199999999999996,48.4,26.8,26.8,26.8,26.8,250.60000000000005,{"$f":"CX42/'Student Profile'!P43","v":50.120000000000012},32]
[{"$f":"ANNUAL!A45","v":""},{"$f":"ANNUAL!B45","v":""},{"$f":"IF('Student Profile'!D44>0,'Student Profile'!D44,\"\")","v":""},{"$f":"IF(ISNUMBER('UT1'!E45),'UT1'!E45,\"\")","v":82},{"$f":"IF(ISNUMBER('UT 2'!E45),'UT 2'!E45,\"\")","v":82},{"$f":"IF(ISNUMBER('UT 3 '!E45),'UT 3 '!E45,\"\")","v":82},{"$f":"IF('TT 1'!E45>0,'TT 1'!E45,\"\")","v":55},{"$f":"IF('UT 4'!E45>0,'UT 4'!E45,\"\")","v":82},{"$f":"IF('UT 5PB1'!E45>0,'UT 5PB1'!E45,\"\")","v":82},{"$f":"IF('PREANNU PB2 '!E45>0,'PREANNU PB2 '!E45,\"\")","v":82},{"$f":"IF(ANNUAL!E45>0,ANNUAL!E45,\"\")","v":49},8.1999999999999993,8.1999999999999993,8.1999999999999993,8.1999999999999993,{"$f":"IF(OR(ISNUMBER(L43),ISNUMBER(M43),ISNUMBER(N43),ISNUMBER(O43),ISNUMBER(G43),ISNUMBER(K43)),SUM(L43,M43,N43,O43,('TT 1'!D44*0.3),(ANNUAL!D44*0.3)),\"\")","v":41.8},{"$f":"IF(ISNUMBER('UT1'!H45),'UT1'!H45,\"\")","v":49},{"$f":"IF(ISNUMBER('UT 2'!H45),'UT 2'!H45,\"\")","v":82},{"$f":"IF(ISNUMBER('UT 3 '!H45),'UT 3 '!H45,\"\")","v":82},{"$f":"IF('TT 1'!H45>0,'TT 1'!H45,\"\")","v":82},{"$f":"IF('UT 4'!H45>0,'UT 4'!H45,\"\")","v":82},{"$f":"IF('UT 5PB1'!H45>0,'UT 5PB1'!H45,\"\")","v":82},{"$f":"IF('PREANNU PB2 '!H45>0,'PREANNU PB2 '!H45,\"\")","v":82},{"$f":"IF(ANNUAL!H45>0,ANNUAL!H45,\"\")","v":82},8.1999999999999993,8.1999999999999993,8.1999999999999993,8.1999999999999993,{"$f":"IF(OR(ISNUMBER(Y43),ISNUMBER(Z43),ISNUMBER(AA43),ISNUMBER(AB43),ISNUMBER(T43),ISNUMBER(X43)),SUM(Y43,Z43,AA43,AB43,('TT 1'!E44*0.3),(ANNUAL!E44*0.3)),\"\")","v":58.3},{"$f":"IF(ISNUMBER('UT1'!K45),'UT1'!K45,\"\")","v":82},{"$f":"IF(ISNUMBER('UT 2'!K45),'UT 2'!K45,\"\")","v":82},{"$f":"IF(ISNUMBER('UT 3 '!K45),'UT 3 '!K45,\"\")","v":82},{"$f":"IF('TT 1'!K45>0,'TT 1'!K45,\"\")","v":82},{"$f":"IF('UT 4'!K45>0,'UT 4'!K45,\"\")","v":82},{"$f":"IF('UT 5PB1'!K45>0,'UT 5PB1'!K45,\"\")","v":82},{"$f":"IF('PREANNU PB2 '!K45>0,'PREANNU PB2 '!K45,\"\")","v":82},{"$f":"IF(ANNUAL!K45>0,ANNUAL!K45,\"\")","v":82},8.1999999999999993,8.1999999999999993,8.1999999999999993,8.1999999999999993,{"$f":"IF(OR(ISNUMBER(AL43),ISNUMBER(AM43),ISNUMBER(AN43),ISNUMBER(AO43),ISNUMBER(AG43),ISNUMBER(AK43)),SUM(AL43,AM43,AN43,AO43,('TT 1'!R44*0.3),(ANNUAL!R44*0.3)),\"\")","v":47.8},{"$f":"IF(ISNUMBER('UT1'!N45),'UT1'!N45,\"\")","v":82},{"$f":"IF(ISNUMBER('UT 2'!N45),'UT 2'!N45,\"\")","v":82},{"$f":"IF(ISNUMBER('UT 3 '!N45),'UT 3 '!N45,\"\")","v":82},{"$f":"IF('TT 1'!N45>0,'TT 1'!N45,\"\")","v":82},{"$f":"IF('UT 4'!N45>0,'UT 4'!N45,\"\")","v":82},{"$f":"IF('UT 5PB1'!N45>0,'UT 5PB1'!N45,\"\")","v":82},{"$f":"IF('PREANNU PB2 '!N45>0,'PREANNU PB2 '!N45,\"\")","v":82},{"$f":"IF(ANNUAL!N45>0,ANNUAL!N45,\"\")","v":82},8.1999999999999993,8.1999999999999993,8.1999999999999993,8.1999999999999993,{"$f":"IF(OR(ISNUMBER(AY43),ISNUMBER(AZ43),ISNUMBER(BA43),ISNUMBER(BB43),ISNUMBER(AT43),ISNUMBER(AX43)),SUM(AY43,AZ43,BA43,BB43,('TT 1'!AE44*0.3),(ANNUAL!AE44*0.3)),\"\")","v":32.799999999999997},{"$f":"IF(ISNUMBER('UT1'!Q45),'UT1'!Q45,\"\")","v":82},{"$f":"IF(ISNUMBER('UT 2'!Q45),'UT 2'!Q45,\"\")","v":82},{"$f":"IF(ISNUMBER('UT 3 '!Q45),'UT 3 '!Q45,\"\")","v":82},{"$f":"IF('TT 1'!Q45>0,'TT 1'!Q45,\"\")","v":82},{"$f":"IF('UT 4'!Q45>0,'UT 4'!Q45,\"\")","v":82},{"$f":"IF('UT 5PB1'!Q45>0,'UT 5PB1'!Q45,\"\")","v":82},{"$f":"IF('PREANNU PB2 '!Q45>0,'PREANNU PB2 '!Q45,\"\")","v":82},{"$f":"IF(ANNUAL!Q45>0,ANNUAL!Q45,\"\")","v":82},8.1999999999999993,8.1999999999999993,8.1999999999999993,8.1999999999999993,{"$f":"IF(OR(ISNUMBER(BL43),ISNUMBER(BM43),ISNUMBER(BN43),ISNUMBER(BO43),ISNUMBER(BG43),ISNUMBER(BK43)),SUM(BL43,BM43,BN43,BO43,('TT 1'!AR44*0.3),(ANNUAL!AR44*0.3)),\"\")","v":32.799999999999997},{"$f":"IF(ISNUMBER('UT1'!T45),'UT1'!T45,\"\")","v":82},{"$f":"IF(ISNUMBER('UT 2'!T45),'UT 2'!T45,\"\")","v":82},{"$f":"IF(ISNUMBER('UT 3 '!T45),'UT 3 '!T45,\"\")","v":82},{"$f":"IF('TT 1'!T45>0,'TT 1'!T45,\"\")","v":82},{"$f":"IF('UT 4'!T45>0,'UT 4'!T45,\"\")","v":82},{"$f":"IF('UT 5PB1'!T45>0,'UT 5PB1'!T45,\"\")","v":82},{"$f":"IF('PREANNU PB2 '!T45>0,'PREANNU PB2 '!T45,\"\")","v":82},{"$f":"IF(ANNUAL!T45>0,ANNUAL!T45,\"\")","v":82},8.1999999999999993,8.1999999999999993,8.1999999999999993,8.1999999999999993,{"$f":"IF(OR(ISNUMBER(BY43),ISNUMBER(BZ43),ISNUMBER(CA43),ISNUMBER(CB43),ISNUMBER(BT43),ISNUMBER(BX43)),SUM(BY43,BZ43,CA43,CB43,('TT 1'!BE44*0.3),(ANNUAL!BE44*0.3)),\"\")","v":32.799999999999997},{"$f":"IF(ISNUMBER('UT1'!W45),'UT1'!W45,\"\")","v":82},{"$f":"IF(ISNUMBER('UT 2'!W45),'UT 2'!W45,\"\")","v":82},{"$f":"IF(ISNUMBER('UT 3 '!W45),'UT 3 '!W45,\"\")","v":82},{"$f":"IF('TT 1'!W45>0,'TT 1'!W45,\"\")","v":82},{"$f":"IF('UT 4'!W45>0,'UT 4'!W45,\"\")","v":82},{"$f":"IF('UT 5PB1'!W45>0,'UT 5PB1'!W45,\"\")","v":82},{"$f":"IF('PREANNU PB2 '!W45>0,'PREANNU PB2 '!W45,\"\")","v":82},{"$f":"IF(ANNUAL!W45>0,ANNUAL!W45,\"\")","v":82},8.1999999999999993,8.1999999999999993,8.1999999999999993,8.1999999999999993,{"$f":"IF(OR(ISNUMBER(CL43),ISNUMBER(CM43),ISNUMBER(CN43),ISNUMBER(CO43),ISNUMBER(CG43),ISNUMBER(CK43)),SUM(CL43,CM43,CN43,CO43,('TT 1'!BR44*0.3),(ANNUAL!BR44*0.3)),\"\")","v":32.799999999999997},41.8,58.3,47.8,32.799999999999997,32.799999999999997,32.799999999999997,32.799999999999997,279.10000000000002,{"$f":"CX43/'Student Profile'!P44","v":55.820000000000007},14]
[{"$f":"ANNUAL!A46","v":""},{"$f":"ANNUAL!B46","v":""},{"$f":"IF('Student Profile'!D45>0,'Student Profile'!D45,\"\")","v":""},{"$f":"IF(ISNUMBER('UT1'!E46),'UT1'!E46,\"\")","v":77},{"$f":"IF(ISNUMBER('UT 2'!E46),'UT 2'!E46,\"\")","v":77},{"$f":"IF(ISNUMBER('UT 3 '!E46),'UT 3 '!E46,\"\")","v":77},{"$f":"IF('TT 1'!E46>0,'TT 1'!E46,\"\")","v":52},{"$f":"IF('UT 4'!E46>0,'UT 4'!E46,\"\")","v":77},{"$f":"IF('UT 5PB1'!E46>0,'UT 5PB1'!E46,\"\")","v":77},{"$f":"IF('PREANNU PB2 '!E46>0,'PREANNU PB2 '!E46,\"\")","v":77},{"$f":"IF(ANNUAL!E46>0,ANNUAL!E46,\"\")","v":46},7.7,7.7,7.7,7.7,{"$f":"IF(OR(ISNUMBER(L44),ISNUMBER(M44),ISNUMBER(N44),ISNUMBER(O44),ISNUMBER(G44),ISNUMBER(K44)),SUM(L44,M44,N44,O44,('TT 1'!D45*0.3),(ANNUAL!D45*0.3)),\"\")","v":39.799999999999997},{"$f":"IF(ISNUMBER('UT1'!H46),'UT1'!H46,\"\")","v":46},{"$f":"IF(ISNUMBER('UT 2'!H46),'UT 2'!H46,\"\")","v":77},{"$f":"IF(ISNUMBER('UT 3 '!H46),'UT 3 '!H46,\"\")","v":77},{"$f":"IF('TT 1'!H46>0,'TT 1'!H46,\"\")","v":77},{"$f":"IF('UT 4'!H46>0,'UT 4'!H46,\"\")","v":77},{"$f":"IF('UT 5PB1'!H46>0,'UT 5PB1'!H46,\"\")","v":77},{"$f":"IF('PREANNU PB2 '!H46>0,'PREANNU PB2 '!H46,\"\")","v":77},{"$f":"IF(ANNUAL!H46>0,ANNUAL!H46,\"\")","v":77},7.7,7.7,7.7,7.7,{"$f":"IF(OR(ISNUMBER(Y44),ISNUMBER(Z44),ISNUMBER(AA44),ISNUMBER(AB44),ISNUMBER(T44),ISNUMBER(X44)),SUM(Y44,Z44,AA44,AB44,('TT 1'!E45*0.3),(ANNUAL!E45*0.3)),\"\")","v":62},{"$f":"IF(ISNUMBER('UT1'!K46),'UT1'!K46,\"\")","v":77},{"$f":"IF(ISNUMBER('UT 2'!K46),'UT 2'!K46,\"\")","v":77},{"$f":"IF(ISNUMBER('UT 3 '!K46),'UT 3 '!K46,\"\")","v":77},{"$f":"IF('TT 1'!K46>0,'TT 1'!K46,\"\")","v":77},{"$f":"IF('UT 4'!K46>0,'UT 4'!K46,\"\")","v":77},{"$f":"IF('UT 5PB1'!K46>0,'UT 5PB1'!K46,\"\")","v":77},{"$f":"IF('PREANNU PB2 '!K46>0,'PREANNU PB2 '!K46,\"\")","v":77},{"$f":"IF(ANNUAL!K46>0,ANNUAL!K46,\"\")","v":77},7.7,7.7,7.7,7.7,{"$f":"IF(OR(ISNUMBER(AL44),ISNUMBER(AM44),ISNUMBER(AN44),ISNUMBER(AO44),ISNUMBER(AG44),ISNUMBER(AK44)),SUM(AL44,AM44,AN44,AO44,('TT 1'!R45*0.3),(ANNUAL!R45*0.3)),\"\")","v":51.2},{"$f":"IF(ISNUMBER('UT1'!N46),'UT1'!N46,\"\")","v":77},{"$f":"IF(ISNUMBER('UT 2'!N46),'UT 2'!N46,\"\")","v":77},{"$f":"IF(ISNUMBER('UT 3 '!N46),'UT 3 '!N46,\"\")","v":77},{"$f":"IF('TT 1'!N46>0,'TT 1'!N46,\"\")","v":77},{"$f":"IF('UT 4'!N46>0,'UT 4'!N46,\"\")","v":77},{"$f":"IF('UT 5PB1'!N46>0,'UT 5PB1'!N46,\"\")","v":77},{"$f":"IF('PREANNU PB2 '!N46>0,'PREANNU PB2 '!N46,\"\")","v":77},{"$f":"IF(ANNUAL!N46>0,ANNUAL!N46,\"\")","v":77},7.7,7.7,7.7,7.7,{"$f":"IF(OR(ISNUMBER(AY44),ISNUMBER(AZ44),ISNUMBER(BA44),ISNUMBER(BB44),ISNUMBER(AT44),ISNUMBER(AX44)),SUM(AY44,AZ44,BA44,BB44,('TT 1'!AE45*0.3),(ANNUAL!AE45*0.3)),\"\")","v":30.8},{"$f":"IF(ISNUMBER('UT1'!Q46),'UT1'!Q46,\"\")","v":77},{"$f":"IF(ISNUMBER('UT 2'!Q46),'UT 2'!Q46,\"\")","v":77},{"$f":"IF(ISNUMBER('UT 3 '!Q46),'UT 3 '!Q46,\"\")","v":77},{"$f":"IF('TT 1'!Q46>0,'TT 1'!Q46,\"\")","v":77},{"$f":"IF('UT 4'!Q46>0,'UT 4'!Q46,\"\")","v":77},{"$f":"IF('UT 5PB1'!Q46>0,'UT 5PB1'!Q46,\"\")","v":77},{"$f":"IF('PREANNU PB2 '!Q46>0,'PREANNU PB2 '!Q46,\"\")","v":77},{"$f":"IF(ANNUAL!Q46>0,ANNUAL!Q46,\"\")","v":77},7.7,7.7,7.7,7.7,{"$f":"IF(OR(ISNUMBER(BL44),ISNUMBER(BM44),ISNUMBER(BN44),ISNUMBER(BO44),ISNUMBER(BG44),ISNUMBER(BK44)),SUM(BL44,BM44,BN44,BO44,('TT 1'!AR45*0.3),(ANNUAL!AR45*0.3)),\"\")","v":30.8},{"$f":"IF(ISNUMBER('UT1'!T46),'UT1'!T46,\"\")","v":77},{"$f":"IF(ISNUMBER('UT 2'!T46),'UT 2'!T46,\"\")","v":77},{"$f":"IF(ISNUMBER('UT 3 '!T46),'UT 3 '!T46,\"\")","v":77},{"$f":"IF('TT 1'!T46>0,'TT 1'!T46,\"\")","v":77},{"$f":"IF('UT 4'!T46>0,'UT 4'!T46,\"\")","v":77},{"$f":"IF('UT 5PB1'!T46>0,'UT 5PB1'!T46,\"\")","v":77},{"$f":"IF('PREANNU PB2 '!T46>0,'PREANNU PB2 '!T46,\"\")","v":77},{"$f":"IF(ANNUAL!T46>0,ANNUAL!T46,\"\")","v":77},7.7,7.7,7.7,7.7,{"$f":"IF(OR(ISNUMBER(BY44),ISNUMBER(BZ44),ISNUMBER(CA44),ISNUMBER(CB44),ISNUMBER(BT44),ISNUMBER(BX44)),SUM(BY44,BZ44,CA44,CB44,('TT 1'!BE45*0.3),(ANNUAL!BE45*0.3)),\"\")","v":30.8},{"$f":"IF(ISNUMBER('UT1'!W46),'UT1'!W46,\"\")","v":77},{"$f":"IF(ISNUMBER('UT 2'!W46),'UT 2'!W46,\"\")","v":77},{"$f":"IF(ISNUMBER('UT 3 '!W46),'UT 3 '!W46,\"\")","v":77},{"$f":"IF('TT 1'!W46>0,'TT 1'!W46,\"\")","v":77},{"$f":"IF('UT 4'!W46>0,'UT 4'!W46,\"\")","v":77},{"$f":"IF('UT 5PB1'!W46>0,'UT 5PB1'!W46,\"\")","v":77},{"$f":"IF('PREANNU PB2 '!W46>0,'PREANNU PB2 '!W46,\"\")","v":77},{"$f":"IF(ANNUAL!W46>0,ANNUAL!W46,\"\")","v":77},7.7,7.7,7.7,7.7,{"$f":"IF(OR(ISNUMBER(CL44),ISNUMBER(CM44),ISNUMBER(CN44),ISNUMBER(CO44),ISNUMBER(CG44),ISNUMBER(CK44)),SUM(CL44,CM44,CN44,CO44,('TT 1'!BR45*0.3),(ANNUAL!BR45*0.3)),\"\")","v":30.8},39.799999999999997,62,51.2,30.8,30.8,30.8,30.8,276.20000000000005,{"$f":"CX44/'Student Profile'!P45","v":55.240000000000009},19]
[{"$f":"ANNUAL!A47","v":""},{"$f":"ANNUAL!B47","v":""},{"$f":"IF('Student Profile'!D46>0,'Student Profile'!D46,\"\")","v":""},{"$f":"IF(ISNUMBER('UT1'!E47),'UT1'!E47,\"\")","v":74},{"$f":"IF(ISNUMBER('UT 2'!E47),'UT 2'!E47,\"\")","v":74},{"$f":"IF(ISNUMBER('UT 3 '!E47),'UT 3 '!E47,\"\")","v":74},{"$f":"IF('TT 1'!E47>0,'TT 1'!E47,\"\")","v":49},{"$f":"IF('UT 4'!E47>0,'UT 4'!E47,\"\")","v":74},{"$f":"IF('UT 5PB1'!E47>0,'UT 5PB1'!E47,\"\")","v":74},{"$f":"IF('PREANNU PB2 '!E47>0,'PREANNU PB2 '!E47,\"\")","v":74},{"$f":"IF(ANNUAL!E47>0,ANNUAL!E47,\"\")","v":44},7.4,7.4,7.4,7.4,{"$f":"IF(OR(ISNUMBER(L45),ISNUMBER(M45),ISNUMBER(N45),ISNUMBER(O45),ISNUMBER(G45),ISNUMBER(K45)),SUM(L45,M45,N45,O45,('TT 1'!D46*0.3),(ANNUAL!D46*0.3)),\"\")","v":40.4},{"$f":"IF(ISNUMBER('UT1'!H47),'UT1'!H47,\"\")","v":44},{"$f":"IF(ISNUMBER('UT 2'!H47),'UT 2'!H47,\"\")","v":74},{"$f":"IF(ISNUMBER('UT 3 '!H47),'UT 3 '!H47,\"\")","v":74},{"$f":"IF('TT 1'!H47>0,'TT 1'!H47,\"\")","v":74},{"$f":"IF('UT 4'!H47>0,'UT 4'!H47,\"\")","v":74},{"$f":"IF('UT 5PB1'!H47>0,'UT 5PB1'!H47,\"\")","v":74},{"$f":"IF('PREANNU PB2 '!H47>0,'PREANNU PB2 '!H47,\"\")","v":74},{"$f":"IF(ANNUAL!H47>0,ANNUAL!H47,\"\")","v":74},7.4,7.4,7.4,7.4,{"$f":"IF(OR(ISNUMBER(Y45),ISNUMBER(Z45),ISNUMBER(AA45),ISNUMBER(AB45),ISNUMBER(T45),ISNUMBER(X45)),SUM(Y45,Z45,AA45,AB45,('TT 1'!E46*0.3),(ANNUAL!E46*0.3)),\"\")","v":59},{"$f":"IF(ISNUMBER('UT1'!K47),'UT1'!K47,\"\")","v":74},{"$f":"IF(ISNUMBER('UT 2'!K47),'UT 2'!K47,\"\")","v":74},{"$f":"IF(ISNUMBER('UT 3 '!K47),'UT 3 '!K47,\"\")","v":74},{"$f":"IF('TT 1'!K47>0,'TT 1'!K47,\"\")","v":74},{"$f":"IF('UT 4'!K47>0,'UT 4'!K47,\"\")","v":74},{"$f":"IF('UT 5PB1'!K47>0,'UT 5PB1'!K47,\"\")","v":74},{"$f":"IF('PREANNU PB2 '!K47>0,'PREANNU PB2 '!K47,\"\")","v":74},{"$f":"IF(ANNUAL!K47>0,ANNUAL!K47,\"\")","v":74},7.4,7.4,7.4,7.4,{"$f":"IF(OR(ISNUMBER(AL45),ISNUMBER(AM45),ISNUMBER(AN45),ISNUMBER(AO45),ISNUMBER(AG45),ISNUMBER(AK45)),SUM(AL45,AM45,AN45,AO45,('TT 1'!R46*0.3),(ANNUAL!R46*0.3)),\"\")","v":46.4},{"$f":"IF(ISNUMBER('UT1'!N47),'UT1'!N47,\"\")","v":74},{"$f":"IF(ISNUMBER('UT 2'!N47),'UT 2'!N47,\"\")","v":74},{"$f":"IF(ISNUMBER('UT 3 '!N47),'UT 3 '!N47,\"\")","v":74},{"$f":"IF('TT 1'!N47>0,'TT 1'!N47,\"\")","v":74},{"$f":"IF('UT 4'!N47>0,'UT 4'!N47,\"\")","v":74},{"$f":"IF('UT 5PB1'!N47>0,'UT 5PB1'!N47,\"\")","v":74},{"$f":"IF('PREANNU PB2 '!N47>0,'PREANNU PB2 '!N47,\"\")","v":74},{"$f":"IF(ANNUAL!N47>0,ANNUAL!N47,\"\")","v":74},7.4,7.4,7.4,7.4,{"$f":"IF(OR(ISNUMBER(AY45),ISNUMBER(AZ45),ISNUMBER(BA45),ISNUMBER(BB45),ISNUMBER(AT45),ISNUMBER(AX45)),SUM(AY45,AZ45,BA45,BB45,('TT 1'!AE46*0.3),(ANNUAL!AE46*0.3)),\"\")","v":29.6},{"$f":"IF(ISNUMBER('UT1'!Q47),'UT1'!Q47,\"\")","v":74},{"$f":"IF(ISNUMBER('UT 2'!Q47),'UT 2'!Q47,\"\")","v":74},{"$f":"IF(ISNUMBER('UT 3 '!Q47),'UT 3 '!Q47,\"\")","v":74},{"$f":"IF('TT 1'!Q47>0,'TT 1'!Q47,\"\")","v":74},{"$f":"IF('UT 4'!Q47>0,'UT 4'!Q47,\"\")","v":74},{"$f":"IF('UT 5PB1'!Q47>0,'UT 5PB1'!Q47,\"\")","v":74},{"$f":"IF('PREANNU PB2 '!Q47>0,'PREANNU PB2 '!Q47,\"\")","v":74},{"$f":"IF(ANNUAL!Q47>0,ANNUAL!Q47,\"\")","v":74},7.4,7.4,7.4,7.4,{"$f":"IF(OR(ISNUMBER(BL45),ISNUMBER(BM45),ISNUMBER(BN45),ISNUMBER(BO45),ISNUMBER(BG45),ISNUMBER(BK45)),SUM(BL45,BM45,BN45,BO45,('TT 1'!AR46*0.3),(ANNUAL!AR46*0.3)),\"\")","v":29.6},{"$f":"IF(ISNUMBER('UT1'!T47),'UT1'!T47,\"\")","v":74},{"$f":"IF(ISNUMBER('UT 2'!T47),'UT 2'!T47,\"\")","v":74},{"$f":"IF(ISNUMBER('UT 3 '!T47),'UT 3 '!T47,\"\")","v":74},{"$f":"IF('TT 1'!T47>0,'TT 1'!T47,\"\")","v":74},{"$f":"IF('UT 4'!T47>0,'UT 4'!T47,\"\")","v":74},{"$f":"IF('UT 5PB1'!T47>0,'UT 5PB1'!T47,\"\")","v":74},{"$f":"IF('PREANNU PB2 '!T47>0,'PREANNU PB2 '!T47,\"\")","v":74},{"$f":"IF(ANNUAL!T47>0,ANNUAL!T47,\"\")","v":74},7.4,7.4,7.4,7.4,{"$f":"IF(OR(ISNUMBER(BY45),ISNUMBER(BZ45),ISNUMBER(CA45),ISNUMBER(CB45),ISNUMBER(BT45),ISNUMBER(BX45)),SUM(BY45,BZ45,CA45,CB45,('TT 1'!BE46*0.3),(ANNUAL!BE46*0.3)),\"\")","v":29.6},{"$f":"IF(ISNUMBER('UT1'!W47),'UT1'!W47,\"\")","v":74},{"$f":"IF(ISNUMBER('UT 2'!W47),'UT 2'!W47,\"\")","v":74},{"$f":"IF(ISNUMBER('UT 3 '!W47),'UT 3 '!W47,\"\")","v":74},{"$f":"IF('TT 1'!W47>0,'TT 1'!W47,\"\")","v":74},{"$f":"IF('UT 4'!W47>0,'UT 4'!W47,\"\")","v":74},{"$f":"IF('UT 5PB1'!W47>0,'UT 5PB1'!W47,\"\")","v":74},{"$f":"IF('PREANNU PB2 '!W47>0,'PREANNU PB2 '!W47,\"\")","v":74},{"$f":"IF(ANNUAL!W47>0,ANNUAL!W47,\"\")","v":74},7.4,7.4,7.4,7.4,{"$f":"IF(OR(ISNUMBER(CL45),ISNUMBER(CM45),ISNUMBER(CN45),ISNUMBER(CO45),ISNUMBER(CG45),ISNUMBER(CK45)),SUM(CL45,CM45,CN45,CO45,('TT 1'!BR46*0.3),(ANNUAL!BR46*0.3)),\"\")","v":29.6},40.4,59,46.4,29.6,29.6,29.6,29.6,264.2,{"$f":"CX45/'Student Profile'!P46","v":52.839999999999996},24]
[{"$f":"ANNUAL!A48","v":""},{"$f":"ANNUAL!B48","v":""},{"$f":"IF('Student Profile'!D47>0,'Student Profile'!D47,\"\")","v":""},{"$f":"IF(ISNUMBER('UT1'!E48),'UT1'!E48,\"\")","v":85},{"$f":"IF(ISNUMBER('UT 2'!E48),'UT 2'!E48,\"\")","v":85},{"$f":"IF(ISNUMBER('UT 3 '!E48),'UT 3 '!E48,\"\")","v":85},{"$f":"IF('TT 1'!E48>0,'TT 1'!E48,\"\")","v":57},{"$f":"IF('UT 4'!E48>0,'UT 4'!E48,\"\")","v":85},{"$f":"IF('UT 5PB1'!E48>0,'UT 5PB1'!E48,\"\")","v":85},{"$f":"IF('PREANNU PB2 '!E48>0,'PREANNU PB2 '!E48,\"\")","v":85},{"$f":"IF(ANNUAL!E48>0,ANNUAL!E48,\"\")","v":51},8.5,8.5,8.5,8.5,{"$f":"IF(OR(ISNUMBER(L46),ISNUMBER(M46),ISNUMBER(N46),ISNUMBER(O46),ISNUMBER(G46),ISNUMBER(K46)),SUM(L46,M46,N46,O46,('TT 1'!D47*0.3),(ANNUAL!D47*0.3)),\"\")","v":43},{"$f":"IF(ISNUMBER('UT1'!H48),'UT1'!H48,\"\")","v":51},{"$f":"IF(ISNUMBER('UT 2'!H48),'UT 2'!H48,\"\")","v":85},{"$f":"IF(ISNUMBER('UT 3 '!H48),'UT 3 '!H48,\"\")","v":85},{"$f":"IF('TT 1'!H48>0,'TT 1'!H48,\"\")","v":85},{"$f":"IF('UT 4'!H48>0,'UT 4'!H48,\"\")","v":85},{"$f":"IF('UT 5PB1'!H48>0,'UT 5PB1'!H48,\"\")","v":85},{"$f":"IF('PREANNU PB2 '!H48>0,'PREANNU PB2 '!H48,\"\")","v":85},{"$f":"IF(ANNUAL!H48>0,ANNUAL!H48,\"\")","v":85},8.5,8.5,8.5,8.5,{"$f":"IF(OR(ISNUMBER(Y46),ISNUMBER(Z46),ISNUMBER(AA46),ISNUMBER(AB46),ISNUMBER(T46),ISNUMBER(X46)),SUM(Y46,Z46,AA46,AB46,('TT 1'!E47*0.3),(ANNUAL!E47*0.3)),\"\")","v":61.900000000000006},{"$f":"IF(ISNUMBER('UT1'!K48),'UT1'!K48,\"\")","v":85},{"$f":"IF(ISNUMBER('UT 2'!K48),'UT 2'!K48,\"\")","v":85},{"$f":"IF(ISNUMBER('UT 3 '!K48),'UT 3 '!K48,\"\")","v":85},{"$f":"IF('TT 1'!K48>0,'TT 1'!K48,\"\")","v":85},{"$f":"IF('UT 4'!K48>0,'UT 4'!K48,\"\")","v":85},{"$f":"IF('UT 5PB1'!K48>0,'UT 5PB1'!K48,\"\")","v":85},{"$f":"IF('PREANNU PB2 '!K48>0,'PREANNU PB2 '!K48,\"\")","v":85},{"$f":"IF(ANNUAL!K48>0,ANNUAL!K48,\"\")","v":85},8.5,8.5,8.5,8.5,{"$f":"IF(OR(ISNUMBER(AL46),ISNUMBER(AM46),ISNUMBER(AN46),ISNUMBER(AO46),ISNUMBER(AG46),ISNUMBER(AK46)),SUM(AL46,AM46,AN46,AO46,('TT 1'!R47*0.3),(ANNUAL!R47*0.3)),\"\")","v":51.400000000000006},{"$f":"IF(ISNUMBER('UT1'!N48),'UT1'!N48,\"\")","v":85},{"$f":"IF(ISNUMBER('UT 2'!N48),'UT 2'!N48,\"\")","v":85},{"$f":"IF(ISNUMBER('UT 3 '!N48),'UT 3 '!N48,\"\")","v":85},{"$f":"IF('TT 1'!N48>0,'TT 1'!N48,\"\")","v":85},{"$f":"IF('UT 4'!N48>0,'UT 4'!N48,\"\")","v":85},{"$f":"IF('UT 5PB1'!N48>0,'UT 5PB1'!N48,\"\")","v":85},{"$f":"IF('PREANNU PB2 '!N48>0,'PREANNU PB2 '!N48,\"\")","v":85},{"$f":"IF(ANNUAL!N48>0,ANNUAL!N48,\"\")","v":85},8.5,8.5,8.5,8.5,{"$f":"IF(OR(ISNUMBER(AY46),ISNUMBER(AZ46),ISNUMBER(BA46),ISNUMBER(BB46),ISNUMBER(AT46),ISNUMBER(AX46)),SUM(AY46,AZ46,BA46,BB46,('TT 1'!AE47*0.3),(ANNUAL!AE47*0.3)),\"\")","v":34},{"$f":"IF(ISNUMBER('UT1'!Q48),'UT1'!Q48,\"\")","v":85},{"$f":"IF(ISNUMBER('UT 2'!Q48),'UT 2'!Q48,\"\")","v":85},{"$f":"IF(ISNUMBER('UT 3 '!Q48),'UT 3 '!Q48,\"\")","v":85},{"$f":"IF('TT 1'!Q48>0,'TT 1'!Q48,\"\")","v":85},{"$f":"IF('UT 4'!Q48>0,'UT 4'!Q48,\"\")","v":85},{"$f":"IF('UT 5PB1'!Q48>0,'UT 5PB1'!Q48,\"\")","v":85},{"$f":"IF('PREANNU PB2 '!Q48>0,'PREANNU PB2 '!Q48,\"\")","v":85},{"$f":"IF(ANNUAL!Q48>0,ANNUAL!Q48,\"\")","v":85},8.5,8.5,8.5,8.5,{"$f":"IF(OR(ISNUMBER(BL46),ISNUMBER(BM46),ISNUMBER(BN46),ISNUMBER(BO46),ISNUMBER(BG46),ISNUMBER(BK46)),SUM(BL46,BM46,BN46,BO46,('TT 1'!AR47*0.3),(ANNUAL!AR47*0.3)),\"\")","v":34},{"$f":"IF(ISNUMBER('UT1'!T48),'UT1'!T48,\"\")","v":85},{"$f":"IF(ISNUMBER('UT 2'!T48),'UT 2'!T48,\"\")","v":85},{"$f":"IF(ISNUMBER('UT 3 '!T48),'UT 3 '!T48,\"\")","v":85},{"$f":"IF('TT 1'!T48>0,'TT 1'!T48,\"\")","v":85},{"$f":"IF('UT 4'!T48>0,'UT 4'!T48,\"\")","v":85},{"$f":"IF('UT 5PB1'!T48>0,'UT 5PB1'!T48,\"\")","v":85},{"$f":"IF('PREANNU PB2 '!T48>0,'PREANNU PB2 '!T48,\"\")","v":85},{"$f":"IF(ANNUAL!T48>0,ANNUAL!T48,\"\")","v":85},8.5,8.5,8.5,8.5,{"$f":"IF(OR(ISNUMBER(BY46),ISNUMBER(BZ46),ISNUMBER(CA46),ISNUMBER(CB46),ISNUMBER(BT46),ISNUMBER(BX46)),SUM(BY46,BZ46,CA46,CB46,('TT 1'!BE47*0.3),(ANNUAL!BE47*0.3)),\"\")","v":34},{"$f":"IF(ISNUMBER('UT1'!W48),'UT1'!W48,\"\")","v":85},{"$f":"IF(ISNUMBER('UT 2'!W48),'UT 2'!W48,\"\")","v":85},{"$f":"IF(ISNUMBER('UT 3 '!W48),'UT 3 '!W48,\"\")","v":85},{"$f":"IF('TT 1'!W48>0,'TT 1'!W48,\"\")","v":85},{"$f":"IF('UT 4'!W48>0,'UT 4'!W48,\"\")","v":85},{"$f":"IF('UT 5PB1'!W48>0,'UT 5PB1'!W48,\"\")","v":85},{"$f":"IF('PREANNU PB2 '!W48>0,'PREANNU PB2 '!W48,\"\")","v":85},{"$f":"IF(ANNUAL!W48>0,ANNUAL!W48,\"\")","v":85},8.5,8.5,8.5,8.5,{"$f":"IF(OR(ISNUMBER(CL46),ISNUMBER(CM46),ISNUMBER(CN46),ISNUMBER(CO46),ISNUMBER(CG46),ISNUMBER(CK46)),SUM(CL46,CM46,CN46,CO46,('TT 1'!BR47*0.3),(ANNUAL!BR47*0.3)),\"\")","v":34},43,61.900000000000006,51.400000000000006,34,34,34,34,292.3,{"$f":"CX46/'Student Profile'!P47","v":58.46},9]
[{"$f":"ANNUAL!A49","v":""},{"$f":"ANNUAL!B49","v":""},{"$f":"IF('Student Profile'!D48>0,'Student Profile'!D48,\"\")","v":""},{"$f":"IF(ISNUMBER('UT1'!E49),'UT1'!E49,\"\")","v":67},{"$f":"IF(ISNUMBER('UT 2'!E49),'UT 2'!E49,\"\")","v":67},{"$f":"IF(ISNUMBER('UT 3 '!E49),'UT 3 '!E49,\"\")","v":67},{"$f":"IF('TT 1'!E49>0,'TT 1'!E49,\"\")","v":45},{"$f":"IF('UT 4'!E49>0,'UT 4'!E49,\"\")","v":67},{"$f":"IF('UT 5PB1'!E49>0,'UT 5PB1'!E49,\"\")","v":67},{"$f":"IF('PREANNU PB2 '!E49>0,'PREANNU PB2 '!E49,\"\")","v":67},{"$f":"IF(ANNUAL!E49>0,ANNUAL!E49,\"\")","v":40},6.7,6.7,6.7,6.7,{"$f":"IF(OR(ISNUMBER(L47),ISNUMBER(M47),ISNUMBER(N47),ISNUMBER(O47),ISNUMBER(G47),ISNUMBER(K47)),SUM(L47,M47,N47,O47,('TT 1'!D48*0.3),(ANNUAL!D48*0.3)),\"\")","v":35.799999999999997},{"$f":"IF(ISNUMBER('UT1'!H49),'UT1'!H49,\"\")","v":40},{"$f":"IF(ISNUMBER('UT 2'!H49),'UT 2'!H49,\"\")","v":67},{"$f":"IF(ISNUMBER('UT 3 '!H49),'UT 3 '!H49,\"\")","v":67},{"$f":"IF('TT 1'!H49>0,'TT 1'!H49,\"\")","v":67},{"$f":"IF('UT 4'!H49>0,'UT 4'!H49,\"\")","v":67},{"$f":"IF('UT 5PB1'!H49>0,'UT 5PB1'!H49,\"\")","v":67},{"$f":"IF('PREANNU PB2 '!H49>0,'PREANNU PB2 '!H49,\"\")","v":67},{"$f":"IF(ANNUAL!H49>0,ANNUAL!H49,\"\")","v":67},6.7,6.7,6.7,6.7,{"$f":"IF(OR(ISNUMBER(Y47),ISNUMBER(Z47),ISNUMBER(AA47),ISNUMBER(AB47),ISNUMBER(T47),ISNUMBER(X47)),SUM(Y47,Z47,AA47,AB47,('TT 1'!E48*0.3),(ANNUAL!E48*0.3)),\"\")","v":59.199999999999996},{"$f":"IF(ISNUMBER('UT1'!K49),'UT1'!K49,\"\")","v":67},{"$f":"IF(ISNUMBER('UT 2'!K49),'UT 2'!K49,\"\")","v":67},{"$f":"IF(ISNUMBER('UT 3 '!K49),'UT 3 '!K49,\"\")","v":67},{"$f":"IF('TT 1'!K49>0,'TT 1'!K49,\"\")","v":67},{"$f":"IF('UT 4'!K49>0,'UT 4'!K49,\"\")","v":67},{"$f":"IF('UT 5PB1'!K49>0,'UT 5PB1'!K49,\"\")","v":67},{"$f":"IF('PREANNU PB2 '!K49>0,'PREANNU PB2 '!K49,\"\")","v":67},{"$f":"IF(ANNUAL!K49>0,ANNUAL!K49,\"\")","v":67},6.7,6.7,6.7,6.7,{"$f":"IF(OR(ISNUMBER(AL47),ISNUMBER(AM47),ISNUMBER(AN47),ISNUMBER(AO47),ISNUMBER(AG47),ISNUMBER(AK47)),SUM(AL47,AM47,AN47,AO47,('TT 1'!R48*0.3),(ANNUAL!R48*0.3)),\"\")","v":48.4},{"$f":"IF(ISNUMBER('UT1'!N49),'UT1'!N49,\"\")","v":67},{"$f":"IF(ISNUMBER('UT 2'!N49),'UT 2'!N49,\"\")","v":67},{"$f":"IF(ISNUMBER('UT 3 '!N49),'UT 3 '!N49,\"\")","v":67},{"$f":"IF('TT 1'!N49>0,'TT 1'!N49,\"\")","v":67},{"$f":"IF('UT 4'!N49>0,'UT 4'!N49,\"\")","v":67},{"$f":"IF('UT 5PB1'!N49>0,'UT 5PB1'!N49,\"\")","v":67},{"$f":"IF('PREANNU PB2 '!N49>0,'PREANNU PB2 '!N49,\"\")","v":67},{"$f":"IF(ANNUAL!N49>0,ANNUAL!N49,\"\")","v":67},6.7,6.7,6.7,6.7,{"$f":"IF(OR(ISNUMBER(AY47),ISNUMBER(AZ47),ISNUMBER(BA47),ISNUMBER(BB47),ISNUMBER(AT47),ISNUMBER(AX47)),SUM(AY47,AZ47,BA47,BB47,('TT 1'!AE48*0.3),(ANNUAL!AE48*0.3)),\"\")","v":26.8},{"$f":"IF(ISNUMBER('UT1'!Q49),'UT1'!Q49,\"\")","v":67},{"$f":"IF(ISNUMBER('UT 2'!Q49),'UT 2'!Q49,\"\")","v":67},{"$f":"IF(ISNUMBER('UT 3 '!Q49),'UT 3 '!Q49,\"\")","v":67},{"$f":"IF('TT 1'!Q49>0,'TT 1'!Q49,\"\")","v":67},{"$f":"IF('UT 4'!Q49>0,'UT 4'!Q49,\"\")","v":67},{"$f":"IF('UT 5PB1'!Q49>0,'UT 5PB1'!Q49,\"\")","v":67},{"$f":"IF('PREANNU PB2 '!Q49>0,'PREANNU PB2 '!Q49,\"\")","v":67},{"$f":"IF(ANNUAL!Q49>0,ANNUAL!Q49,\"\")","v":67},6.7,6.7,6.7,6.7,{"$f":"IF(OR(ISNUMBER(BL47),ISNUMBER(BM47),ISNUMBER(BN47),ISNUMBER(BO47),ISNUMBER(BG47),ISNUMBER(BK47)),SUM(BL47,BM47,BN47,BO47,('TT 1'!AR48*0.3),(ANNUAL!AR48*0.3)),\"\")","v":26.8},{"$f":"IF(ISNUMBER('UT1'!T49),'UT1'!T49,\"\")","v":67},{"$f":"IF(ISNUMBER('UT 2'!T49),'UT 2'!T49,\"\")","v":67},{"$f":"IF(ISNUMBER('UT 3 '!T49),'UT 3 '!T49,\"\")","v":67},{"$f":"IF('TT 1'!T49>0,'TT 1'!T49,\"\")","v":67},{"$f":"IF('UT 4'!T49>0,'UT 4'!T49,\"\")","v":67},{"$f":"IF('UT 5PB1'!T49>0,'UT 5PB1'!T49,\"\")","v":67},{"$f":"IF('PREANNU PB2 '!T49>0,'PREANNU PB2 '!T49,\"\")","v":67},{"$f":"IF(ANNUAL!T49>0,ANNUAL!T49,\"\")","v":67},6.7,6.7,6.7,6.7,{"$f":"IF(OR(ISNUMBER(BY47),ISNUMBER(BZ47),ISNUMBER(CA47),ISNUMBER(CB47),ISNUMBER(BT47),ISNUMBER(BX47)),SUM(BY47,BZ47,CA47,CB47,('TT 1'!BE48*0.3),(ANNUAL!BE48*0.3)),\"\")","v":26.8},{"$f":"IF(ISNUMBER('UT1'!W49),'UT1'!W49,\"\")","v":67},{"$f":"IF(ISNUMBER('UT 2'!W49),'UT 2'!W49,\"\")","v":67},{"$f":"IF(ISNUMBER('UT 3 '!W49),'UT 3 '!W49,\"\")","v":67},{"$f":"IF('TT 1'!W49>0,'TT 1'!W49,\"\")","v":67},{"$f":"IF('UT 4'!W49>0,'UT 4'!W49,\"\")","v":67},{"$f":"IF('UT 5PB1'!W49>0,'UT 5PB1'!W49,\"\")","v":67},{"$f":"IF('PREANNU PB2 '!W49>0,'PREANNU PB2 '!W49,\"\")","v":67},{"$f":"IF(ANNUAL!W49>0,ANNUAL!W49,\"\")","v":67},6.7,6.7,6.7,6.7,{"$f":"IF(OR(ISNUMBER(CL47),ISNUMBER(CM47),ISNUMBER(CN47),ISNUMBER(CO47),ISNUMBER(CG47),ISNUMBER(CK47)),SUM(CL47,CM47,CN47,CO47,('TT 1'!BR48*0.3),(ANNUAL!BR48*0.3)),\"\")","v":26.8},35.799999999999997,59.199999999999996,48.4,26.8,26.8,26.8,26.8,250.60000000000005,{"$f":"CX47/'Student Profile'!P48","v":50.120000000000012},32]
[{"$f":"ANNUAL!A50","v":""},{"$f":"ANNUAL!B50","v":""},{"$f":"IF('Student Profile'!D49>0,'Student Profile'!D49,\"\")","v":""},{"$f":"IF(ISNUMBER('UT1'!E50),'UT1'!E50,\"\")","v":82},{"$f":"IF(ISNUMBER('UT 2'!E50),'UT 2'!E50,\"\")","v":82},{"$f":"IF(ISNUMBER('UT 3 '!E50),'UT 3 '!E50,\"\")","v":82},{"$f":"IF('TT 1'!E50>0,'TT 1'!E50,\"\")","v":55},{"$f":"IF('UT 4'!E50>0,'UT 4'!E50,\"\")","v":82},{"$f":"IF('UT 5PB1'!E50>0,'UT 5PB1'!E50,\"\")","v":82},{"$f":"IF('PREANNU PB2 '!E50>0,'PREANNU PB2 '!E50,\"\")","v":82},{"$f":"IF(ANNUAL!E50>0,ANNUAL!E50,\"\")","v":49},8.1999999999999993,8.1999999999999993,8.1999999999999993,8.1999999999999993,{"$f":"IF(OR(ISNUMBER(L48),ISNUMBER(M48),ISNUMBER(N48),ISNUMBER(O48),ISNUMBER(G48),ISNUMBER(K48)),SUM(L48,M48,N48,O48,('TT 1'!D49*0.3),(ANNUAL!D49*0.3)),\"\")","v":41.8},{"$f":"IF(ISNUMBER('UT1'!H50),'UT1'!H50,\"\")","v":49},{"$f":"IF(ISNUMBER('UT 2'!H50),'UT 2'!H50,\"\")","v":82},{"$f":"IF(ISNUMBER('UT 3 '!H50),'UT 3 '!H50,\"\")","v":82},{"$f":"IF('TT 1'!H50>0,'TT 1'!H50,\"\")","v":82},{"$f":"IF('UT 4'!H50>0,'UT 4'!H50,\"\")","v":82},{"$f":"IF('UT 5PB1'!H50>0,'UT 5PB1'!H50,\"\")","v":82},{"$f":"IF('PREANNU PB2 '!H50>0,'PREANNU PB2 '!H50,\"\")","v":82},{"$f":"IF(ANNUAL!H50>0,ANNUAL!H50,\"\")","v":82},8.1999999999999993,8.1999999999999993,8.1999999999999993,8.1999999999999993,{"$f":"IF(OR(ISNUMBER(Y48),ISNUMBER(Z48),ISNUMBER(AA48),ISNUMBER(AB48),ISNUMBER(T48),ISNUMBER(X48)),SUM(Y48,Z48,AA48,AB48,('TT 1'!E49*0.3),(ANNUAL!E49*0.3)),\"\")","v":58.3},{"$f":"IF(ISNUMBER('UT1'!K50),'UT1'!K50,\"\")","v":82},{"$f":"IF(ISNUMBER('UT 2'!K50),'UT 2'!K50,\"\")","v":82},{"$f":"IF(ISNUMBER('UT 3 '!K50),'UT 3 '!K50,\"\")","v":82},{"$f":"IF('TT 1'!K50>0,'TT 1'!K50,\"\")","v":82},{"$f":"IF('UT 4'!K50>0,'UT 4'!K50,\"\")","v":82},{"$f":"IF('UT 5PB1'!K50>0,'UT 5PB1'!K50,\"\")","v":82},{"$f":"IF('PREANNU PB2 '!K50>0,'PREANNU PB2 '!K50,\"\")","v":82},{"$f":"IF(ANNUAL!K50>0,ANNUAL!K50,\"\")","v":82},8.1999999999999993,8.1999999999999993,8.1999999999999993,8.1999999999999993,{"$f":"IF(OR(ISNUMBER(AL48),ISNUMBER(AM48),ISNUMBER(AN48),ISNUMBER(AO48),ISNUMBER(AG48),ISNUMBER(AK48)),SUM(AL48,AM48,AN48,AO48,('TT 1'!R49*0.3),(ANNUAL!R49*0.3)),\"\")","v":47.8},{"$f":"IF(ISNUMBER('UT1'!N50),'UT1'!N50,\"\")","v":82},{"$f":"IF(ISNUMBER('UT 2'!N50),'UT 2'!N50,\"\")","v":82},{"$f":"IF(ISNUMBER('UT 3 '!N50),'UT 3 '!N50,\"\")","v":82},{"$f":"IF('TT 1'!N50>0,'TT 1'!N50,\"\")","v":82},{"$f":"IF('UT 4'!N50>0,'UT 4'!N50,\"\")","v":82},{"$f":"IF('UT 5PB1'!N50>0,'UT 5PB1'!N50,\"\")","v":82},{"$f":"IF('PREANNU PB2 '!N50>0,'PREANNU PB2 '!N50,\"\")","v":82},{"$f":"IF(ANNUAL!N50>0,ANNUAL!N50,\"\")","v":82},8.1999999999999993,8.1999999999999993,8.1999999999999993,8.1999999999999993,{"$f":"IF(OR(ISNUMBER(AY48),ISNUMBER(AZ48),ISNUMBER(BA48),ISNUMBER(BB48),ISNUMBER(AT48),ISNUMBER(AX48)),SUM(AY48,AZ48,BA48,BB48,('TT 1'!AE49*0.3),(ANNUAL!AE49*0.3)),\"\")","v":32.799999999999997},{"$f":"IF(ISNUMBER('UT1'!Q50),'UT1'!Q50,\"\")","v":82},{"$f":"IF(ISNUMBER('UT 2'!Q50),'UT 2'!Q50,\"\")","v":82},{"$f":"IF(ISNUMBER('UT 3 '!Q50),'UT 3 '!Q50,\"\")","v":82},{"$f":"IF('TT 1'!Q50>0,'TT 1'!Q50,\"\")","v":82},{"$f":"IF('UT 4'!Q50>0,'UT 4'!Q50,\"\")","v":82},{"$f":"IF('UT 5PB1'!Q50>0,'UT 5PB1'!Q50,\"\")","v":82},{"$f":"IF('PREANNU PB2 '!Q50>0,'PREANNU PB2 '!Q50,\"\")","v":82},{"$f":"IF(ANNUAL!Q50>0,ANNUAL!Q50,\"\")","v":82},8.1999999999999993,8.1999999999999993,8.1999999999999993,8.1999999999999993,{"$f":"IF(OR(ISNUMBER(BL48),ISNUMBER(BM48),ISNUMBER(BN48),ISNUMBER(BO48),ISNUMBER(BG48),ISNUMBER(BK48)),SUM(BL48,BM48,BN48,BO48,('TT 1'!AR49*0.3),(ANNUAL!AR49*0.3)),\"\")","v":32.799999999999997},{"$f":"IF(ISNUMBER('UT1'!T50),'UT1'!T50,\"\")","v":82},{"$f":"IF(ISNUMBER('UT 2'!T50),'UT 2'!T50,\"\")","v":82},{"$f":"IF(ISNUMBER('UT 3 '!T50),'UT 3 '!T50,\"\")","v":82},{"$f":"IF('TT 1'!T50>0,'TT 1'!T50,\"\")","v":82},{"$f":"IF('UT 4'!T50>0,'UT 4'!T50,\"\")","v":82},{"$f":"IF('UT 5PB1'!T50>0,'UT 5PB1'!T50,\"\")","v":82},{"$f":"IF('PREANNU PB2 '!T50>0,'PREANNU PB2 '!T50,\"\")","v":82},{"$f":"IF(ANNUAL!T50>0,ANNUAL!T50,\"\")","v":82},8.1999999999999993,8.1999999999999993,8.1999999999999993,8.1999999999999993,{"$f":"IF(OR(ISNUMBER(BY48),ISNUMBER(BZ48),ISNUMBER(CA48),ISNUMBER(CB48),ISNUMBER(BT48),ISNUMBER(BX48)),SUM(BY48,BZ48,CA48,CB48,('TT 1'!BE49*0.3),(ANNUAL!BE49*0.3)),\"\")","v":32.799999999999997},{"$f":"IF(ISNUMBER('UT1'!W50),'UT1'!W50,\"\")","v":82},{"$f":"IF(ISNUMBER('UT 2'!W50),'UT 2'!W50,\"\")","v":82},{"$f":"IF(ISNUMBER('UT 3 '!W50),'UT 3 '!W50,\"\")","v":82},{"$f":"IF('TT 1'!W50>0,'TT 1'!W50,\"\")","v":82},{"$f":"IF('UT 4'!W50>0,'UT 4'!W50,\"\")","v":82},{"$f":"IF('UT 5PB1'!W50>0,'UT 5PB1'!W50,\"\")","v":82},{"$f":"IF('PREANNU PB2 '!W50>0,'PREANNU PB2 '!W50,\"\")","v":82},{"$f":"IF(ANNUAL!W50>0,ANNUAL!W50,\"\")","v":82},8.1999999999999993,8.1999999999999993,8.1999999999999993,8.1999999999999993,{"$f":"IF(OR(ISNUMBER(CL48),ISNUMBER(CM48),ISNUMBER(CN48),ISNUMBER(CO48),ISNUMBER(CG48),ISNUMBER(CK48)),SUM(CL48,CM48,CN48,CO48,('TT 1'!BR49*0.3),(ANNUAL!BR49*0.3)),\"\")","v":32.799999999999997},41.8,58.3,47.8,32.799999999999997,32.799999999999997,32.799999999999997,32.799999999999997,279.10000000000002,{"$f":"CX48/'Student Profile'!P49","v":55.820000000000007},14]
[{"$f":"ANNUAL!A51","v":""},{"$f":"ANNUAL!B51","v":""},{"$f":"IF('Student Profile'!D50>0,'Student Profile'!D50,\"\")","v":""},{"$f":"IF(ISNUMBER('UT1'!E51),'UT1'!E51,\"\")","v":77},{"$f":"IF(ISNUMBER('UT 2'!E51),'UT 2'!E51,\"\")","v":77},{"$f":"IF(ISNUMBER('UT 3 '!E51),'UT 3 '!E51,\"\")","v":77},{"$f":"IF('TT 1'!E51>0,'TT 1'!E51,\"\")","v":52},{"$f":"IF('UT 4'!E51>0,'UT 4'!E51,\"\")","v":77},{"$f":"IF('UT 5PB1'!E51>0,'UT 5PB1'!E51,\"\")","v":77},{"$f":"IF('PREANNU PB2 '!E51>0,'PREANNU PB2 '!E51,\"\")","v":77},{"$f":"IF(ANNUAL!E51>0,ANNUAL!E51,\"\")","v":46},7.7,7.7,7.7,7.7,{"$f":"IF(OR(ISNUMBER(L49),ISNUMBER(M49),ISNUMBER(N49),ISNUMBER(O49),ISNUMBER(G49),ISNUMBER(K49)),SUM(L49,M49,N49,O49,('TT 1'!D50*0.3),(ANNUAL!D50*0.3)),\"\")","v":39.799999999999997},{"$f":"IF(ISNUMBER('UT1'!H51),'UT1'!H51,\"\")","v":46},{"$f":"IF(ISNUMBER('UT 2'!H51),'UT 2'!H51,\"\")","v":77},{"$f":"IF(ISNUMBER('UT 3 '!H51),'UT 3 '!H51,\"\")","v":77},{"$f":"IF('TT 1'!H51>0,'TT 1'!H51,\"\")","v":77},{"$f":"IF('UT 4'!H51>0,'UT 4'!H51,\"\")","v":77},{"$f":"IF('UT 5PB1'!H51>0,'UT 5PB1'!H51,\"\")","v":77},{"$f":"IF('PREANNU PB2 '!H51>0,'PREANNU PB2 '!H51,\"\")","v":77},{"$f":"IF(ANNUAL!H51>0,ANNUAL!H51,\"\")","v":77},7.7,7.7,7.7,7.7,{"$f":"IF(OR(ISNUMBER(Y49),ISNUMBER(Z49),ISNUMBER(AA49),ISNUMBER(AB49),ISNUMBER(T49),ISNUMBER(X49)),SUM(Y49,Z49,AA49,AB49,('TT 1'!E50*0.3),(ANNUAL!E50*0.3)),\"\")","v":62},{"$f":"IF(ISNUMBER('UT1'!K51),'UT1'!K51,\"\")","v":77},{"$f":"IF(ISNUMBER('UT 2'!K51),'UT 2'!K51,\"\")","v":77},{"$f":"IF(ISNUMBER('UT 3 '!K51),'UT 3 '!K51,\"\")","v":77},{"$f":"IF('TT 1'!K51>0,'TT 1'!K51,\"\")","v":77},{"$f":"IF('UT 4'!K51>0,'UT 4'!K51,\"\")","v":77},{"$f":"IF('UT 5PB1'!K51>0,'UT 5PB1'!K51,\"\")","v":77},{"$f":"IF('PREANNU PB2 '!K51>0,'PREANNU PB2 '!K51,\"\")","v":77},{"$f":"IF(ANNUAL!K51>0,ANNUAL!K51,\"\")","v":77},7.7,7.7,7.7,7.7,{"$f":"IF(OR(ISNUMBER(AL49),ISNUMBER(AM49),ISNUMBER(AN49),ISNUMBER(AO49),ISNUMBER(AG49),ISNUMBER(AK49)),SUM(AL49,AM49,AN49,AO49,('TT 1'!R50*0.3),(ANNUAL!R50*0.3)),\"\")","v":51.2},{"$f":"IF(ISNUMBER('UT1'!N51),'UT1'!N51,\"\")","v":77},{"$f":"IF(ISNUMBER('UT 2'!N51),'UT 2'!N51,\"\")","v":77},{"$f":"IF(ISNUMBER('UT 3 '!N51),'UT 3 '!N51,\"\")","v":77},{"$f":"IF('TT 1'!N51>0,'TT 1'!N51,\"\")","v":77},{"$f":"IF('UT 4'!N51>0,'UT 4'!N51,\"\")","v":77},{"$f":"IF('UT 5PB1'!N51>0,'UT 5PB1'!N51,\"\")","v":77},{"$f":"IF('PREANNU PB2 '!N51>0,'PREANNU PB2 '!N51,\"\")","v":77},{"$f":"IF(ANNUAL!N51>0,ANNUAL!N51,\"\")","v":77},7.7,7.7,7.7,7.7,{"$f":"IF(OR(ISNUMBER(AY49),ISNUMBER(AZ49),ISNUMBER(BA49),ISNUMBER(BB49),ISNUMBER(AT49),ISNUMBER(AX49)),SUM(AY49,AZ49,BA49,BB49,('TT 1'!AE50*0.3),(ANNUAL!AE50*0.3)),\"\")","v":30.8},{"$f":"IF(ISNUMBER('UT1'!Q51),'UT1'!Q51,\"\")","v":77},{"$f":"IF(ISNUMBER('UT 2'!Q51),'UT 2'!Q51,\"\")","v":77},{"$f":"IF(ISNUMBER('UT 3 '!Q51),'UT 3 '!Q51,\"\")","v":77},{"$f":"IF('TT 1'!Q51>0,'TT 1'!Q51,\"\")","v":77},{"$f":"IF('UT 4'!Q51>0,'UT 4'!Q51,\"\")","v":77},{"$f":"IF('UT 5PB1'!Q51>0,'UT 5PB1'!Q51,\"\")","v":77},{"$f":"IF('PREANNU PB2 '!Q51>0,'PREANNU PB2 '!Q51,\"\")","v":77},{"$f":"IF(ANNUAL!Q51>0,ANNUAL!Q51,\"\")","v":77},7.7,7.7,7.7,7.7,{"$f":"IF(OR(ISNUMBER(BL49),ISNUMBER(BM49),ISNUMBER(BN49),ISNUMBER(BO49),ISNUMBER(BG49),ISNUMBER(BK49)),SUM(BL49,BM49,BN49,BO49,('TT 1'!AR50*0.3),(ANNUAL!AR50*0.3)),\"\")","v":30.8},{"$f":"IF(ISNUMBER('UT1'!T51),'UT1'!T51,\"\")","v":77},{"$f":"IF(ISNUMBER('UT 2'!T51),'UT 2'!T51,\"\")","v":77},{"$f":"IF(ISNUMBER('UT 3 '!T51),'UT 3 '!T51,\"\")","v":77},{"$f":"IF('TT 1'!T51>0,'TT 1'!T51,\"\")","v":77},{"$f":"IF('UT 4'!T51>0,'UT 4'!T51,\"\")","v":77},{"$f":"IF('UT 5PB1'!T51>0,'UT 5PB1'!T51,\"\")","v":77},{"$f":"IF('PREANNU PB2 '!T51>0,'PREANNU PB2 '!T51,\"\")","v":77},{"$f":"IF(ANNUAL!T51>0,ANNUAL!T51,\"\")","v":77},7.7,7.7,7.7,7.7,{"$f":"IF(OR(ISNUMBER(BY49),ISNUMBER(BZ49),ISNUMBER(CA49),ISNUMBER(CB49),ISNUMBER(BT49),ISNUMBER(BX49)),SUM(BY49,BZ49,CA49,CB49,('TT 1'!BE50*0.3),(ANNUAL!BE50*0.3)),\"\")","v":30.8},{"$f":"IF(ISNUMBER('UT1'!W51),'UT1'!W51,\"\")","v":77},{"$f":"IF(ISNUMBER('UT 2'!W51),'UT 2'!W51,\"\")","v":77},{"$f":"IF(ISNUMBER('UT 3 '!W51),'UT 3 '!W51,\"\")","v":77},{"$f":"IF('TT 1'!W51>0,'TT 1'!W51,\"\")","v":77},{"$f":"IF('UT 4'!W51>0,'UT 4'!W51,\"\")","v":77},{"$f":"IF('UT 5PB1'!W51>0,'UT 5PB1'!W51,\"\")","v":77},{"$f":"IF('PREANNU PB2 '!W51>0,'PREANNU PB2 '!W51,\"\")","v":77},{"$f":"IF(ANNUAL!W51>0,ANNUAL!W51,\"\")","v":77},7.7,7.7,7.7,7.7,{"$f":"IF(OR(ISNUMBER(CL49),ISNUMBER(CM49),ISNUMBER(CN49),ISNUMBER(CO49),ISNUMBER(CG49),ISNUMBER(CK49)),SUM(CL49,CM49,CN49,CO49,('TT 1'!BR50*0.3),(ANNUAL!BR50*0.3)),\"\")","v":30.8},39.799999999999997,62,51.2,30.8,30.8,30.8,30.8,276.20000000000005,{"$f":"CX49/'Student Profile'!P50","v":55.240000000000009},19]
[{"$f":"ANNUAL!A52","v":""},{"$f":"ANNUAL!B52","v":""},{"$f":"IF('Student Profile'!D51>0,'Student Profile'!D51,\"\")","v":""},{"$f":"IF(ISNUMBER('UT1'!E52),'UT1'!E52,\"\")","v":20},{"$f":"IF(ISNUMBER('UT 2'!E52),'UT 2'!E52,\"\")","v":20},{"$f":"IF(ISNUMBER('UT 3 '!E52),'UT 3 '!E52,\"\")","v":20},{"$f":"IF('TT 1'!E52>0,'TT 1'!E52,\"\")","v":14},{"$f":"IF('UT 4'!E52>0,'UT 4'!E52,\"\")","v":20},{"$f":"IF('UT 5PB1'!E52>0,'UT 5PB1'!E52,\"\")","v":20},{"$f":"IF('PREANNU PB2 '!E52>0,'PREANNU PB2 '!E52,\"\")","v":20},{"$f":"IF(ANNUAL!E52>0,ANNUAL!E52,\"\")","v":12},2,2,2,2,{"$f":"IF(OR(ISNUMBER(L50),ISNUMBER(M50),ISNUMBER(N50),ISNUMBER(O50),ISNUMBER(G50),ISNUMBER(K50)),SUM(L50,M50,N50,O50,('TT 1'!D51*0.3),(ANNUAL!D51*0.3)),\"\")","v":18.799999999999997},{"$f":"IF(ISNUMBER('UT1'!H52),'UT1'!H52,\"\")","v":12},{"$f":"IF(ISNUMBER('UT 2'!H52),'UT 2'!H52,\"\")","v":20},{"$f":"IF(ISNUMBER('UT 3 '!H52),'UT 3 '!H52,\"\")","v":20},{"$f":"IF('TT 1'!H52>0,'TT 1'!H52,\"\")","v":20},{"$f":"IF('UT 4'!H52>0,'UT 4'!H52,\"\")","v":20},{"$f":"IF('UT 5PB1'!H52>0,'UT 5PB1'!H52,\"\")","v":20},{"$f":"IF('PREANNU PB2 '!H52>0,'PREANNU PB2 '!H52,\"\")","v":20},{"$f":"IF(ANNUAL!H52>0,ANNUAL!H52,\"\")","v":20},2,2,2,2,{"$f":"IF(OR(ISNUMBER(Y50),ISNUMBER(Z50),ISNUMBER(AA50),ISNUMBER(AB50),ISNUMBER(T50),ISNUMBER(X50)),SUM(Y50,Z50,AA50,AB50,('TT 1'!E51*0.3),(ANNUAL!E51*0.3)),\"\")","v":37.4},{"$f":"IF(ISNUMBER('UT1'!K52),'UT1'!K52,\"\")","v":20},{"$f":"IF(ISNUMBER('UT 2'!K52),'UT 2'!K52,\"\")","v":20},{"$f":"IF(ISNUMBER('UT 3 '!K52),'UT 3 '!K52,\"\")","v":20},{"$f":"IF('TT 1'!K52>0,'TT 1'!K52,\"\")","v":20},{"$f":"IF('UT 4'!K52>0,'UT 4'!K52,\"\")","v":20},{"$f":"IF('UT 5PB1'!K52>0,'UT 5PB1'!K52,\"\")","v":20},{"$f":"IF('PREANNU PB2 '!K52>0,'PREANNU PB2 '!K52,\"\")","v":20},{"$f":"IF(ANNUAL!K52>0,ANNUAL!K52,\"\")","v":20},2,2,2,2,{"$f":"IF(OR(ISNUMBER(AL50),ISNUMBER(AM50),ISNUMBER(AN50),ISNUMBER(AO50),ISNUMBER(AG50),ISNUMBER(AK50)),SUM(AL50,AM50,AN50,AO50,('TT 1'!R51*0.3),(ANNUAL!R51*0.3)),\"\")","v":24.799999999999997},{"$f":"IF(ISNUMBER('UT1'!N52),'UT1'!N52,\"\")","v":20},{"$f":"IF(ISNUMBER('UT 2'!N52),'UT 2'!N52,\"\")","v":20},{"$f":"IF(ISNUMBER('UT 3 '!N52),'UT 3 '!N52,\"\")","v":20},{"$f":"IF('TT 1'!N52>0,'TT 1'!N52,\"\")","v":20},{"$f":"IF('UT 4'!N52>0,'UT 4'!N52,\"\")","v":20},{"$f":"IF('UT 5PB1'!N52>0,'UT 5PB1'!N52,\"\")","v":20},{"$f":"IF('PREANNU PB2 '!N52>0,'PREANNU PB2 '!N52,\"\")","v":20},{"$f":"IF(ANNUAL!N52>0,ANNUAL!N52,\"\")","v":20},2,2,2,2,{"$f":"IF(OR(ISNUMBER(AY50),ISNUMBER(AZ50),ISNUMBER(BA50),ISNUMBER(BB50),ISNUMBER(AT50),ISNUMBER(AX50)),SUM(AY50,AZ50,BA50,BB50,('TT 1'!AE51*0.3),(ANNUAL!AE51*0.3)),\"\")","v":8},{"$f":"IF(ISNUMBER('UT1'!Q52),'UT1'!Q52,\"\")","v":20},{"$f":"IF(ISNUMBER('UT 2'!Q52),'UT 2'!Q52,\"\")","v":20},{"$f":"IF(ISNUMBER('UT 3 '!Q52),'UT 3 '!Q52,\"\")","v":20},{"$f":"IF('TT 1'!Q52>0,'TT 1'!Q52,\"\")","v":20},{"$f":"IF('UT 4'!Q52>0,'UT 4'!Q52,\"\")","v":20},{"$f":"IF('UT 5PB1'!Q52>0,'UT 5PB1'!Q52,\"\")","v":20},{"$f":"IF('PREANNU PB2 '!Q52>0,'PREANNU PB2 '!Q52,\"\")","v":20},{"$f":"IF(ANNUAL!Q52>0,ANNUAL!Q52,\"\")","v":20},{"$f":"IF(OR(ISNUMBER(BD50),ISNUMBER(BE50),ISNUMBER(BF50)),LARGE(BD50:BF50,1)/10,\"\")","v":2},{"$f":"IF(OR(ISNUMBER(BD50),ISNUMBER(BE50),ISNUMBER(BF50)),LARGE(BD50:BF50,2)/10,\"\")","v":2},{"$f":"IF(OR(ISNUMBER(BH50),ISNUMBER(BI50),ISNUMBER(BJ50)),LARGE(BH50:BJ50,1)/10,\"\")","v":2},{"$f":"IF(OR(ISNUMBER(BH50),ISNUMBER(BI50),ISNUMBER(BJ50)),LARGE(BH50:BJ50,2)/10,\"\")","v":2},{"$f":"IF(OR(ISNUMBER(BL50),ISNUMBER(BM50),ISNUMBER(BN50),ISNUMBER(BO50),ISNUMBER(BG50),ISNUMBER(BK50)),SUM(BL50,BM50,BN50,BO50,('TT 1'!AR51*0.3),(ANNUAL!AR51*0.3)),\"\")","v":8},{"$f":"IF(ISNUMBER('UT1'!T52),'UT1'!T52,\"\")","v":20},{"$f":"IF(ISNUMBER('UT 2'!T52),'UT 2'!T52,\"\")","v":20},{"$f":"IF(ISNUMBER('UT 3 '!T52),'UT 3 '!T52,\"\")","v":20},{"$f":"IF('TT 1'!T52>0,'TT 1'!T52,\"\")","v":20},{"$f":"IF('UT 4'!T52>0,'UT 4'!T52,\"\")","v":20},{"$f":"IF('UT 5PB1'!T52>0,'UT 5PB1'!T52,\"\")","v":20},{"$f":"IF('PREANNU PB2 '!T52>0,'PREANNU PB2 '!T52,\"\")","v":20},{"$f":"IF(ANNUAL!T52>0,ANNUAL!T52,\"\")","v":20},{"$f":"IF(OR(ISNUMBER(BQ50),ISNUMBER(BR50),ISNUMBER(BS50)),LARGE(BQ50:BS50,1)/10,\"\")","v":2},{"$f":"IF(OR(ISNUMBER(BQ50),ISNUMBER(BR50),ISNUMBER(BS50)),LARGE(BQ50:BS50,2)/10,\"\")","v":2},{"$f":"IF(OR(ISNUMBER(BU50),ISNUMBER(BV50),ISNUMBER(BW50)),LARGE(BU50:BW50,1)/10,\"\")","v":2},{"$f":"IF(OR(ISNUMBER(BU50),ISNUMBER(BV50),ISNUMBER(BW50)),LARGE(BU50:BW50,2)/10,\"\")","v":2},{"$f":"IF(OR(ISNUMBER(BY50),ISNUMBER(BZ50),ISNUMBER(CA50),ISNUMBER(CB50),ISNUMBER(BT50),ISNUMBER(BX50)),SUM(BY50,BZ50,CA50,CB50,('TT 1'!BE51*0.3),(ANNUAL!BE51*0.3)),\"\")","v":8},{"$f":"IF(ISNUMBER('UT1'!W52),'UT1'!W52,\"\")","v":20},{"$f":"IF(ISNUMBER('UT 2'!W52),'UT 2'!W52,\"\")","v":20},{"$f":"IF(ISNUMBER('UT 3 '!W52),'UT 3 '!W52,\"\")","v":20},{"$f":"IF('TT 1'!W52>0,'TT 1'!W52,\"\")","v":20},{"$f":"IF('UT 4'!W52>0,'UT 4'!W52,\"\")","v":20},{"$f":"IF('UT 5PB1'!W52>0,'UT 5PB1'!W52,\"\")","v":20},{"$f":"IF('PREANNU PB2 '!W52>0,'PREANNU PB2 '!W52,\"\")","v":20},{"$f":"IF(ANNUAL!W52>0,ANNUAL!W52,\"\")","v":20},{"$f":"IF(OR(ISNUMBER(CD50),ISNUMBER(CE50),ISNUMBER(CF50)),LARGE(CD50:CF50,1)/10,\"\")","v":2},{"$f":"IF(OR(ISNUMBER(CD50),ISNUMBER(CE50),ISNUMBER(CF50)),LARGE(CD50:CF50,2)/10,\"\")","v":2},{"$f":"IF(OR(ISNUMBER(CH50),ISNUMBER(CI50),ISNUMBER(CJ50)),LARGE(CH50:CJ50,1)/10,\"\")","v":2},{"$f":"IF(OR(ISNUMBER(CH50),ISNUMBER(CI50),ISNUMBER(CJ50)),LARGE(CH50:CJ50,2)/10,\"\")","v":2},{"$f":"IF(OR(ISNUMBER(CL50),ISNUMBER(CM50),ISNUMBER(CN50),ISNUMBER(CO50),ISNUMBER(CG50),ISNUMBER(CK50)),SUM(CL50,CM50,CN50,CO50,('TT 1'!BR51*0.3),(ANNUAL!BR51*0.3)),\"\")","v":8},18.799999999999997,37.4,24.799999999999997,8,8,8,8,113,{"$f":"CX50/'Student Profile'!P51","v":22.6},45]